{"text_format":"1","workbook":"xlsx","n_sheets":6,"sheets":["Anleitung","Instructions","Eingabeblatt","Ausgabeblatt","Berechnung_Male","Berechnung_Female"],"not_rendered":{"charts":0,"images":2,"macros":1,"external_links":0,"defined_names":0,"comments":0,"pivot_tables":0},"unopened":[],"bounds":{"document_bytes":16777216,"sheet_cells":100000,"rows_first":2000,"rows_last":500,"rows_between":2000,"halvings":0,"cell_chars":16384,"cell_head_chars":4096},"cells_cut":0,"cells_raw":0,"read":"whole","date_system":"1900"}

{"sheet":"Anleitung","index":0,"n_rows":52,"n_cols":4,"rows_kept":52,"cut":false,"hidden":false,"merged":[]}
[]
[null,"Anleitung zum Mirwald-Test zur Bestimmung des biologischen Entwicklungsstandes bei Mädchen und Knaben"]
[]
[null,"Stichwortartige Zusammenfassung des Testprotokolls"]
[]
[null," Körpergewicht bestimmen"]
[null,null,"1.","Kalibrierte Waage verwenden – Nullmessung überprüfen"]
[null,null,"2.","Athlet/in mittig auf Waage, Gewicht auf beide Füsse gleichmässig verteilt"]
[null,null,"3.","Messung auf 0.1 kg genau"]
[null,null,"4.","Erneute Durchführung der Schritte 1 bis 3"]
[null,null,"5.","Falls Unterschied zw. 1. und 2. Messung kleiner als 0.4 kg, dann Durchschnitt als Ergebnis verwenden."]
[null,null,null,"Falls Unterschied grösser ist als 0.4 kg, dann wieder bei Punkt 1 beginnen."]
[]
[null,"Körpergrösse stehend"]
[null,null,"(in „gestreckter“ Haltung – maximale Distanz zwischen Boden und Scheitel des Kopfes. "]
[null,null,"Der Scheitel gilt dabei als höchster Punkt des Schädels, wenn der Kopf exakt horizontal gehalten wird)."]
[]
[null,null,"1.","Athlet/in steht mit Rücken, Gesäss und Fersen gegen die Wand. Füsse sind zusammen und flach auf dem Boden."]
[null,null,"2.","Kopf / Blick horizontal ausrichten."]
[null,null,"3.","Athlet/in atmet möglichst tief ein und hält den Atem an."]
[null,null,"4.","In der maximal gestreckten Haltung (Füsse immer noch flach auf dem  Boden) und am Ende der tiefen Atmung, wird auf 0.1 cm genau gemessen."]
[null,null,"5.","Athlet/in verlässt den Messplatz."]
[null,null,"6.","Erneute Durchführung der Schritte 1 bis 5."]
[null,null,"7.","Falls Unterschied zw. 1. und 2. Messung kleiner als 0.4 cm, dann Durchschnitt als Ergebnis verwenden. "]
[null,null,null,"Falls Unterschied grösser ist als 0.4 cm, dann wieder bei Schritt 1 beginnen."]
[]
[null,"Körpergrösse sitzend"]
[null,null,"(ebenfalls in „gestreckter“ Haltung – maximale Distanz zwischen Scheitel des Kopfes und Oberfläche der Sitzunterlage)."]
[]
[null,null,"1.","Athlet/in setzt sich auf eine Sitzunterlage von bekannter Höhe. Die Hände / Arme liegen locker auf den Oberschenkeln, Gesäss und Rücken gegen die Wand."]
[null,null,"2.","Athlet/in atmet möglichst tief ein und hält den Atem an. Kopf / Blick sind horizontal ausgerichtet. "]
[null,null,null,"Wichtig: Athlet/in darf nicht mit den Füssen vom Boden abstossen und darf nicht die Gesässmuskulatur anspannen."]
[null,null,"3.","In der maximal gestreckten Haltung und am Ende der tiefen Atmung wird auf 0.1 cm genau gemessen."]
[null,null,"4.","Athlet/in verlässt den Messplatz."]
[null,null,"5.","Erneute Durchführung der Schritte 1 bis 4."]
[null,null,"6.","Falls Unterschied zw. 1. und 2. Messung kleiner 0.4 cm, dann Durchschnitt als Ergebnis verwenden. "]
[null,null,null,"Falls Unterschied grösser ist als 0.4 cm, dann wieder bei Schritt 1 beginnen."]
[]
[null,"Es empfiehlt sich, das Protokoll vor der Messung mit mehreren Athlet/innen auszuprobieren."]
[]
[null,"Eingabe im Eingabeblatt: "]
[null,null,"1.","Auf \"neue Eingabe\" anklicken"]
[null,null,"2.","Daten eingeben in Kolonne B bis H"]
[null,null,"3.","Geschlecht vergeben in Kolonne A (m oder f in der Liste auswählen)"]
[]
[null,"Autoren: Marie Javet, Markus Tschopp & Michael Romann (BASPO)"]
[null,"Kontakt: Verbandssupport Leistungssport Swiss Olympic"]
[null,"Version: Januar 2022"]
[]
[null,"Literatur: "]
[null,"Mirwald, R. L., Baxter-Jones, A. D., Bailey, D. A., & Beunen, G. P. (2002). An assessment of maturity from anthropometric"]
[null,"measurements. Medicine and science in sports and exercise, 34(4), 689-694."]

{"sheet":"Instructions","index":1,"n_rows":52,"n_cols":4,"rows_kept":52,"cut":false,"hidden":false,"merged":[]}
[]
[null,"Test Mirwald pour la détermination de l’état de développement biologique des garçons et des filles: guide de réalisation"]
[]
[null,"Le protocole de test en bref"]
[]
[null,"Poids corporel"]
[null,null,"1.","Utiliser une balance calibrée. Contrôler le zéro."]
[null,null,"2."," L’athlète doit se placer au milieu de la balance, son poids réparti équitablement sur ses deux pieds."]
[null,null,"3.","Mesurer le poids à 0,1 kg près."]
[null,null,"4.","Répéter les étapes 1 à 3."]
[null,null,"5.","Si les deux résultats divergent de moins de 0,4 kg, le résultat pris en compte sera la moyenne des deux valeurs. "]
[null,null,null,"Si l’écart entre les deux résultats est supérieur à 0,4 kg, recommencer à l’étape 1. "]
[]
[null,"Taille debout "]
[null,null,"(à mesurer en position «étendue», c’est-à-dire avec une distance maximale entre le sol et le sommet de la tête."]
[null,null,"Sommet de la tête = point du crâne le plus haut lorsque la tête est tenue exactement à l’horizontale)."]
[]
[null,null,"1.","L’athlète est debout, adossé au mur. Son dos, ses fesses et ses talons doivent toucher le mur. Ses pieds sont joints et posés à plat sur le sol."]
[null,null,"2.","Tête / regard à l’horizontale."]
[null,null,"3.","L’athlète inspire aussi profondément que possible et bloque sa respiration."]
[null,null,"4.","Dans la position étendue maximale (les pieds restent sur le sol) et à la fin de la respiration profonde, mesurer la taille du joueur à 0,1 cm près."]
[null,null,"5.","L’athlète se retire de l’endroit de la mesure."]
[null,null,"6.","Répéter les étapes 1 à 5."]
[null,null,"7.","Si les deux résultats divergent de moins de 0,4 cm, le résultat pris en compte sera la moyenne des deux valeurs."]
[null,null,null,"Si l’écart entre les deux résultats est supérieur à 0,4 cm, recommencer à l’étape 1."]
[]
[null,"Taille assis "]
[null,null,"(se mesure également dans une position dite «étendue » c’est-à-dire avec une distance maximale entre le sol et la surface du siège)."]
[]
[null,null,"1.","L’athlète s’assoit sur un siège dont la hauteur est connue. Les mains/bras reposent détendus sur les cuisses ; les fesses et le dos sont contre le mur."]
[null,null,"2.","L’athlète inspire profondément puis bloque sa respiration. Tête et regard sont à l’horizontale. "]
[null,null,null,"Important: l’athlète ne doit pas tendre les muscles du fessier ni exercer de poussée contre le sol avec ses pieds."]
[null,null,"3.","Mesurer la taille en position étendue maximale, à la fin de l’inspiration profonde, à 0,1 cm près."]
[null,null,"4.","L’athlète se retire de l’endroit de la mesure."]
[null,null,"5.","Répéter les étapes 1 à 4."]
[null,null,"6.","Si les deux résultats divergent de moins de 0,4 cm, le résultat pris en compte sera la moyenne des deux valeurs."]
[null,null,null,"Si l’écart entre les deux résultats est supérieur à 0,4 cm, recommencer à l’étape 1."]
[]
[null,"Nous vous recommandons d’exercer ce protocole avec plusieurs joueurs avant la réalisation du test proprement dit. "]
[]
[null,"Entrée des données dans la feuille de données (Eingabeblatt)"]
[null,null,"1.","Cliquer sur le bouton nouvelle entrée"]
[null,null,"2.","Entrer les données dans la colonne B à H"]
[null,null,"3.","Attribuer le sexe à chaque athlète dans la colonne A (m ou f dans la liste déroulante)"]
[]
[null,"Auteurs: Marie Javet, Markus Tschopp & Michael Romann (OFSPO)"]
[null,"Contact: Soutien aux fédérations dans le sport de compétition Swiss Olympic"]
[null,"Version: janvier 2022"]
[]
[null,"Littérature: "]
[null,"Mirwald, R. L., Baxter-Jones, A. D., Bailey, D. A., & Beunen, G. P. (2002). An assessment of maturity from anthropometric"]
[null,"measurements. Medicine and science in sports and exercise, 34(4), 689-694."]

{"sheet":"Eingabeblatt","index":2,"n_rows":500,"n_cols":29,"rows_kept":500,"cut":false,"hidden":false,"merged":[]}
[]
[]
[]
["Geschlecht\nm = male / f = female\n\nSexe\nm = homme /  f = femme","Messdatum\n\n\nDate de la mesure","Name\n\n\nNom","Vorname\n\n\nPrénom","Geburtsdatum\n(tt.mm.jjjj)\n\nDate de naissance\n(jj.mm.aaaa)","Körpergewicht auf der Waage (Kg)\n\nPoids sur la balance (kg)\n\n","Gewicht Kleidung (Kg)\n\n\npoids des habits (kg)","Effektives Gewicht (Kg)\n\nPoids effectif (kg)","Körpergrösse stehend (cm)\n\nTaille debout (cm)","Körpergrösse sitzend (cm) inkl. Sitzhöhe\n\nTaille assise inclus support (cm)","Stuhl/PlyoBox… höhe (cm)\n\nhauteur de la chaise, de la box,… (cm)","Körpergrösse sitzend (cm)\n\nTaille assise (cm)","Beinlänge (cm)\n\n\nLongueur des jambes (cm)","aktuelles chronologisches Alter\n\nÂge chronologique actuel","Geschätztes Alter beim Wachstumsspurt\n\nÂge estimé au pic de croissance","Reifestand\n\n\nEtat de maturité","Biologischer Entwicklungsstand\n\nEtat de développement biologique","Bio. Entwicklungsstand\nZahl (1-3)\n\nEtat de développement biologique\nCatégorie 1-3","BES Zahl (1-5)\nDév. bio. Catégorie 1-5","BES Zahl (1-5)\nDév. Bio Catégorie 1-5","Geschätzte Erwachsenegrösse ( ± 5.4cm)\n\nTaille estimée à l'âge adulte\n( ± 5.4cm)","Geschätzte Wachstumsreserve (cm)\n\nRéserve de croissance estimée (cm)","Prozent Erwachsenengrösse\n\n\nPourcentage de la taille adulte atteinte actuellement",null,null,null,"Spaltenangabe Tabelle"]
["m","2024-09-13","rogez","Lucas","2002-07-15",75,0,{"$f":"F5-G5","v":75},188,169.5,71.5,{"$f":"J5-K5","v":98},{"$f":"I5-L5","v":90},{"$f":"(B5-E5)/365.25","v":22.165639972621491},{"$f":"N5-P5","v":15.741522317037298},{"$f":"IF(A5=\"m\",(-9.236+(0.0002708*M5*L5)+(-0.001663*N5*M5)+(0.007216*N5*L5)+(0.02292*H5/I5*100)),(-9.376+(0.0001882*M5*L5)+(0.0022*N5*M5)+(0.005841*N5*L5)-(0.002658*N5*H5)+(0.07693*(H5/I5)*100)))","v":6.4241176555841948},{"$f":"IF(R5=1,\"Früh / précoce\",IF(R5=2,\"Durchschnittlich / Normal\",\"Spät / Tardif\"))","v":"Spät / Tardif"},{"$f":"IF(A5=\"m\",(IF(O5<12.8,1,IF(O5>14.8,3,2))),(IF(O5<11,1,IF(O5>13,3,2))))","v":3},{"$f":"IF(A5=\"m\",(IF(O5<12.8,1,IF(O5<13.3,2,IF(O5>14.8,5,IF(O5>14.3,4,3))))),(IF(O5<11,1,IF(O5<11.5,2,IF(O5>13,5,IF(O5>12.5,4,3))))))","v":5},{"$f":"IF(S5=1,\"Früh / précoce\",IF(S5=2,\"Möglicherweise Früh / éventuellement précoce\", IF(S5=3,\"Durchschnittlich / Normal\",IF(S5=4,\"Möglicherweise spät / éventuellement tardif\",\"Spät / Tardif\"))))","v":"Spät / Tardif"},{"$f":"I5+V5","v":188},{"$f":"IF(A5=\"m\",VLOOKUP(P5,Berechnung_Male!$A$1:$D$42,AA5,TRUE),VLOOKUP(Eingabeblatt!P5,Berechnung_Female!$A$1:$D$42,AA5,TRUE))","v":0},{"$f":"I5/U5","v":1},null,null,null,{"$f":"IF(A5=\"m\",IF(O5<12.8,2,IF(O5<14.8,3,4)),IF(O5<11,2,IF(O5<13,3,4)))","v":4},null,"m"]
["m","2024-09-13",null,null,"2012-03-12",60,0.5,{"$f":"F6-G6","v":59.5},155,145,75,{"$f":"J6-K6","v":70},{"$f":"I6-L6","v":85},{"$f":"(B6-E6)/365.25","v":12.506502395619439},{"$f":"N6-P6","v":14.701982293612419},{"$f":"IF(A6=\"m\",(-9.236+(0.0002708*M6*L6)+(-0.001663*N6*M6)+(0.007216*N6*L6)+(0.02292*H6/I6*100)),(-9.376+(0.0001882*M6*L6)+(0.0022*N6*M6)+(0.005841*N6*L6)-(0.002658*N6*H6)+(0.07693*(H6/I6)*100)))","v":-2.1954798979929802},{"$f":"IF(R6=1,\"Früh / précoce\",IF(R6=2,\"Durchschnittlich / Normal\",\"Spät / Tardif\"))","v":"Durchschnittlich / Normal"},{"$f":"IF(A6=\"m\",(IF(O6<12.8,1,IF(O6>14.8,3,2))),(IF(O6<11,1,IF(O6>13,3,2))))","v":2},4,{"$f":"IF(S6=1,\"Früh / précoce\",IF(S6=2,\"Möglicherweise Früh / éventuellement précoce\", IF(S6=3,\"Durchschnittlich / Normal\",IF(S6=4,\"Möglicherweise spät / éventuellement tardif\",\"Spät / Tardif\"))))","v":"Möglicherweise spät / éventuellement tardif"},{"$f":"I6+V6","v":186.07},{"$f":"IF(A6=\"m\",VLOOKUP(P6,Berechnung_Male!$A$1:$D$42,AA6,TRUE),VLOOKUP(Eingabeblatt!P6,Berechnung_Female!$A$1:$D$42,AA6,TRUE))","v":31.07},{"$f":"I6/U6","v":0.83301983124630519},null,null,null,3,null,"f"]
["m","2024-09-15",null,null,"2014-03-15",60,0.5,59.5,155,145,75,70,85,10.505133470225873,13.428641335364643,-2.9235078651387703,"Durchschnittlich / Normal",2,3,"Durchschnittlich / Normal",190.04,{"$f":"IF(A7=\"m\",VLOOKUP(P7,Berechnung_Male!$A$1:$D$42,AA7,TRUE),VLOOKUP(Eingabeblatt!P7,Berechnung_Female!$A$1:$D$42,AA7,TRUE))","v":35.04},0.81561776468111979,null,null,null,3]
["f","2024-09-16",null,null,"2014-03-16",60,0.5,59.5,155,145,75,70,85,10.505133470225873,11.209927597933365,-0.70479412770749184,"Durchschnittlich / Normal",2,2,"Möglicherweise Früh / éventuellement précoce",175.44,{"$f":"IF(A8=\"m\",VLOOKUP(P8,Berechnung_Male!$A$1:$D$42,AA8,TRUE),VLOOKUP(Eingabeblatt!P8,Berechnung_Female!$A$1:$D$42,AA8,TRUE))","v":20.440000000000001},0.88349293205654356,null,null,null,3]
[null,null,null,null,null,null,null,0,null,null,null,0,0,0,{"$error":"#DIV/0!"},{"$error":"#DIV/0!"},{"$error":"#DIV/0!"},{"$error":"#DIV/0!"},{"$error":"#DIV/0!"},{"$error":"#DIV/0!"},{"$error":"#DIV/0!"},{"$f":"IF(A9=\"m\",VLOOKUP(P9,Berechnung_Male!$A$1:$D$42,AA9,TRUE),VLOOKUP(Eingabeblatt!P9,Berechnung_Female!$A$1:$D$42,AA9,TRUE))","v":{"$error":"#DIV/0!"}},{"$error":"#DIV/0!"},null,null,null,{"$error":"#DIV/0!"}]
[null,null,null,null,null,null,null,0,null,null,null,0,0,0,{"$error":"#DIV/0!"},{"$error":"#DIV/0!"},{"$error":"#DIV/0!"},{"$error":"#DIV/0!"},{"$error":"#DIV/0!"},{"$error":"#DIV/0!"},{"$error":"#DIV/0!"},{"$f":"IF(A10=\"m\",VLOOKUP(P10,Berechnung_Male!$A$1:$D$42,AA10,TRUE),VLOOKUP(Eingabeblatt!P10,Berechnung_Female!$A$1:$D$42,AA10,TRUE))","v":{"$error":"#DIV/0!"}},{"$error":"#DIV/0!"},null,null,null,{"$error":"#DIV/0!"}]
[null,null,null,null,null,null,null,0,null,null,null,0,0,0,{"$error":"#DIV/0!"},{"$error":"#DIV/0!"},{"$error":"#DIV/0!"},{"$error":"#DIV/0!"},{"$error":"#DIV/0!"},{"$error":"#DIV/0!"},{"$error":"#DIV/0!"},{"$f":"IF(A11=\"m\",VLOOKUP(P11,Berechnung_Male!$A$1:$D$42,AA11,TRUE),VLOOKUP(Eingabeblatt!P11,Berechnung_Female!$A$1:$D$42,AA11,TRUE))","v":{"$error":"#DIV/0!"}},{"$error":"#DIV/0!"},null,null,null,{"$error":"#DIV/0!"}]
[null,null,null,null,null,null,null,0,null,null,null,0,0,0,{"$error":"#DIV/0!"},{"$error":"#DIV/0!"},{"$error":"#DIV/0!"},{"$error":"#DIV/0!"},{"$error":"#DIV/0!"},{"$error":"#DIV/0!"},{"$error":"#DIV/0!"},{"$f":"IF(A12=\"m\",VLOOKUP(P12,Berechnung_Male!$A$1:$D$42,AA12,TRUE),VLOOKUP(Eingabeblatt!P12,Berechnung_Female!$A$1:$D$42,AA12,TRUE))","v":{"$error":"#DIV/0!"}},{"$error":"#DIV/0!"},null,null,null,{"$error":"#DIV/0!"}]
[null,null,null,null,null,null,null,0,null,null,null,0,0,0,{"$error":"#DIV/0!"},{"$error":"#DIV/0!"},{"$error":"#DIV/0!"},{"$error":"#DIV/0!"},{"$error":"#DIV/0!"},{"$error":"#DIV/0!"},{"$error":"#DIV/0!"},{"$f":"IF(A13=\"m\",VLOOKUP(P13,Berechnung_Male!$A$1:$D$42,AA13,TRUE),VLOOKUP(Eingabeblatt!P13,Berechnung_Female!$A$1:$D$42,AA13,TRUE))","v":{"$error":"#DIV/0!"}},{"$error":"#DIV/0!"},null,null,null,{"$error":"#DIV/0!"}]
[null,null,null,null,null,null,null,0,null,null,null,0,0,0,{"$error":"#DIV/0!"},{"$error":"#DIV/0!"},{"$error":"#DIV/0!"},{"$error":"#DIV/0!"},{"$error":"#DIV/0!"},{"$error":"#DIV/0!"},{"$error":"#DIV/0!"},{"$f":"IF(A14=\"m\",VLOOKUP(P14,Berechnung_Male!$A$1:$D$42,AA14,TRUE),VLOOKUP(Eingabeblatt!P14,Berechnung_Female!$A$1:$D$42,AA14,TRUE))","v":{"$error":"#DIV/0!"}},{"$error":"#DIV/0!"},null,null,null,{"$error":"#DIV/0!"}]
[null,null,null,null,null,null,null,0,null,null,null,0,0,0,{"$error":"#DIV/0!"},{"$f":"IF(A15=\"m\",(-9.236+(0.0002708*M15*L15)+(-0.001663*N15*M15)+(0.007216*N15*L15)+(0.02292*H15/I15*100)),(-9.376+(0.0001882*M15*L15)+(0.0022*N15*M15)+(0.005841*N15*L15)-(0.002658*N15*H15)+(0.07693*(H15/I15)*100)))","v":{"$error":"#DIV/0!"}},{"$error":"#DIV/0!"},{"$error":"#DIV/0!"},{"$error":"#DIV/0!"},{"$error":"#DIV/0!"},{"$error":"#DIV/0!"},{"$f":"IF(A15=\"m\",VLOOKUP(P15,Berechnung_Male!$A$1:$D$42,AA15,TRUE),VLOOKUP(Eingabeblatt!P15,Berechnung_Female!$A$1:$D$42,AA15,TRUE))","v":{"$error":"#DIV/0!"}},{"$error":"#DIV/0!"},null,null,null,{"$error":"#DIV/0!"}]
[null,null,null,null,null,null,null,0,null,null,null,0,0,0,{"$error":"#DIV/0!"},{"$error":"#DIV/0!"},{"$error":"#DIV/0!"},{"$error":"#DIV/0!"},{"$error":"#DIV/0!"},{"$error":"#DIV/0!"},{"$error":"#DIV/0!"},{"$f":"IF(A16=\"m\",VLOOKUP(P16,Berechnung_Male!$A$1:$D$42,AA16,TRUE),VLOOKUP(Eingabeblatt!P16,Berechnung_Female!$A$1:$D$42,AA16,TRUE))","v":{"$error":"#DIV/0!"}},{"$error":"#DIV/0!"},null,null,null,{"$error":"#DIV/0!"}]
[null,null,null,null,null,null,null,0,null,null,null,0,0,0,{"$error":"#DIV/0!"},{"$error":"#DIV/0!"},{"$error":"#DIV/0!"},{"$error":"#DIV/0!"},{"$error":"#DIV/0!"},{"$error":"#DIV/0!"},{"$error":"#DIV/0!"},{"$f":"IF(A17=\"m\",VLOOKUP(P17,Berechnung_Male!$A$1:$D$42,AA17,TRUE),VLOOKUP(Eingabeblatt!P17,Berechnung_Female!$A$1:$D$42,AA17,TRUE))","v":{"$error":"#DIV/0!"}},{"$error":"#DIV/0!"},null,null,null,{"$error":"#DIV/0!"}]
[null,null,null,null,null,null,null,0,null,null,null,0,0,0,{"$error":"#DIV/0!"},{"$error":"#DIV/0!"},{"$error":"#DIV/0!"},{"$error":"#DIV/0!"},{"$error":"#DIV/0!"},{"$error":"#DIV/0!"},{"$error":"#DIV/0!"},{"$f":"IF(A18=\"m\",VLOOKUP(P18,Berechnung_Male!$A$1:$D$42,AA18,TRUE),VLOOKUP(Eingabeblatt!P18,Berechnung_Female!$A$1:$D$42,AA18,TRUE))","v":{"$error":"#DIV/0!"}},{"$error":"#DIV/0!"},null,null,null,{"$error":"#DIV/0!"}]
[null,null,null,null,null,null,null,0,null,null,null,0,0,0,{"$error":"#DIV/0!"},{"$error":"#DIV/0!"},{"$error":"#DIV/0!"},{"$error":"#DIV/0!"},{"$error":"#DIV/0!"},{"$error":"#DIV/0!"},{"$error":"#DIV/0!"},{"$f":"IF(A19=\"m\",VLOOKUP(P19,Berechnung_Male!$A$1:$D$42,AA19,TRUE),VLOOKUP(Eingabeblatt!P19,Berechnung_Female!$A$1:$D$42,AA19,TRUE))","v":{"$error":"#DIV/0!"}},{"$error":"#DIV/0!"},null,null,null,{"$error":"#DIV/0!"}]
[null,null,null,null,null,null,null,0,null,null,null,0,0,0,{"$error":"#DIV/0!"},{"$error":"#DIV/0!"},{"$error":"#DIV/0!"},{"$error":"#DIV/0!"},{"$error":"#DIV/0!"},{"$error":"#DIV/0!"},{"$error":"#DIV/0!"},{"$f":"IF(A20=\"m\",VLOOKUP(P20,Berechnung_Male!$A$1:$D$42,AA20,TRUE),VLOOKUP(Eingabeblatt!P20,Berechnung_Female!$A$1:$D$42,AA20,TRUE))","v":{"$error":"#DIV/0!"}},{"$error":"#DIV/0!"},null,null,null,{"$error":"#DIV/0!"}]
[null,null,null,null,null,null,null,0,null,null,null,0,0,0,{"$error":"#DIV/0!"},{"$error":"#DIV/0!"},{"$error":"#DIV/0!"},{"$error":"#DIV/0!"},{"$error":"#DIV/0!"},{"$error":"#DIV/0!"},{"$error":"#DIV/0!"},{"$f":"IF(A21=\"m\",VLOOKUP(P21,Berechnung_Male!$A$1:$D$42,AA21,TRUE),VLOOKUP(Eingabeblatt!P21,Berechnung_Female!$A$1:$D$42,AA21,TRUE))","v":{"$error":"#DIV/0!"}},{"$error":"#DIV/0!"},null,null,null,{"$error":"#DIV/0!"}]
[null,null,null,null,null,null,null,0,null,null,null,0,0,0,{"$error":"#DIV/0!"},{"$error":"#DIV/0!"},{"$error":"#DIV/0!"},{"$error":"#DIV/0!"},{"$error":"#DIV/0!"},{"$error":"#DIV/0!"},{"$error":"#DIV/0!"},{"$f":"IF(A22=\"m\",VLOOKUP(P22,Berechnung_Male!$A$1:$D$42,AA22,TRUE),VLOOKUP(Eingabeblatt!P22,Berechnung_Female!$A$1:$D$42,AA22,TRUE))","v":{"$error":"#DIV/0!"}},{"$error":"#DIV/0!"},null,null,null,{"$error":"#DIV/0!"}]
[null,null,null,null,null,null,null,0,null,null,null,0,0,0,{"$error":"#DIV/0!"},{"$error":"#DIV/0!"},{"$error":"#DIV/0!"},{"$error":"#DIV/0!"},{"$error":"#DIV/0!"},{"$error":"#DIV/0!"},{"$error":"#DIV/0!"},{"$f":"IF(A23=\"m\",VLOOKUP(P23,Berechnung_Male!$A$1:$D$42,AA23,TRUE),VLOOKUP(Eingabeblatt!P23,Berechnung_Female!$A$1:$D$42,AA23,TRUE))","v":{"$error":"#DIV/0!"}},{"$error":"#DIV/0!"},null,null,null,{"$error":"#DIV/0!"}]
[null,null,null,null,null,null,null,0,null,null,null,0,0,0,{"$error":"#DIV/0!"},{"$error":"#DIV/0!"},{"$error":"#DIV/0!"},{"$error":"#DIV/0!"},{"$error":"#DIV/0!"},{"$error":"#DIV/0!"},{"$error":"#DIV/0!"},{"$f":"IF(A24=\"m\",VLOOKUP(P24,Berechnung_Male!$A$1:$D$42,AA24,TRUE),VLOOKUP(Eingabeblatt!P24,Berechnung_Female!$A$1:$D$42,AA24,TRUE))","v":{"$error":"#DIV/0!"}},{"$error":"#DIV/0!"},null,null,null,{"$error":"#DIV/0!"}]
[null,null,null,null,null,null,null,0,null,null,null,0,0,0,{"$error":"#DIV/0!"},{"$error":"#DIV/0!"},{"$error":"#DIV/0!"},{"$error":"#DIV/0!"},{"$error":"#DIV/0!"},{"$error":"#DIV/0!"},{"$error":"#DIV/0!"},{"$f":"IF(A25=\"m\",VLOOKUP(P25,Berechnung_Male!$A$1:$D$42,AA25,TRUE),VLOOKUP(Eingabeblatt!P25,Berechnung_Female!$A$1:$D$42,AA25,TRUE))","v":{"$error":"#DIV/0!"}},{"$error":"#DIV/0!"},null,null,null,{"$error":"#DIV/0!"}]
[null,null,null,null,null,null,null,0,null,null,null,0,0,0,{"$error":"#DIV/0!"},{"$error":"#DIV/0!"},{"$error":"#DIV/0!"},{"$error":"#DIV/0!"},{"$error":"#DIV/0!"},{"$error":"#DIV/0!"},{"$error":"#DIV/0!"},{"$f":"IF(A26=\"m\",VLOOKUP(P26,Berechnung_Male!$A$1:$D$42,AA26,TRUE),VLOOKUP(Eingabeblatt!P26,Berechnung_Female!$A$1:$D$42,AA26,TRUE))","v":{"$error":"#DIV/0!"}},{"$error":"#DIV/0!"},null,null,null,{"$error":"#DIV/0!"}]
[null,null,null,null,null,null,null,0,null,null,null,0,0,0,{"$error":"#DIV/0!"},{"$error":"#DIV/0!"},{"$error":"#DIV/0!"},{"$error":"#DIV/0!"},{"$error":"#DIV/0!"},{"$error":"#DIV/0!"},{"$error":"#DIV/0!"},{"$f":"IF(A27=\"m\",VLOOKUP(P27,Berechnung_Male!$A$1:$D$42,AA27,TRUE),VLOOKUP(Eingabeblatt!P27,Berechnung_Female!$A$1:$D$42,AA27,TRUE))","v":{"$error":"#DIV/0!"}},{"$error":"#DIV/0!"},null,null,null,{"$error":"#DIV/0!"}]
[null,null,null,null,null,null,null,0,null,null,null,0,0,0,{"$error":"#DIV/0!"},{"$error":"#DIV/0!"},{"$error":"#DIV/0!"},{"$error":"#DIV/0!"},{"$error":"#DIV/0!"},{"$error":"#DIV/0!"},{"$error":"#DIV/0!"},{"$f":"IF(A28=\"m\",VLOOKUP(P28,Berechnung_Male!$A$1:$D$42,AA28,TRUE),VLOOKUP(Eingabeblatt!P28,Berechnung_Female!$A$1:$D$42,AA28,TRUE))","v":{"$error":"#DIV/0!"}},{"$error":"#DIV/0!"},null,null,null,{"$error":"#DIV/0!"}]
[null,null,null,null,null,null,null,0,null,null,null,0,0,0,{"$error":"#DIV/0!"},{"$error":"#DIV/0!"},{"$error":"#DIV/0!"},{"$error":"#DIV/0!"},{"$error":"#DIV/0!"},{"$error":"#DIV/0!"},{"$error":"#DIV/0!"},{"$f":"IF(A29=\"m\",VLOOKUP(P29,Berechnung_Male!$A$1:$D$42,AA29,TRUE),VLOOKUP(Eingabeblatt!P29,Berechnung_Female!$A$1:$D$42,AA29,TRUE))","v":{"$error":"#DIV/0!"}},{"$error":"#DIV/0!"},null,null,null,{"$error":"#DIV/0!"}]
[null,null,null,null,null,null,null,0,null,null,null,0,0,0,{"$error":"#DIV/0!"},{"$error":"#DIV/0!"},{"$error":"#DIV/0!"},{"$error":"#DIV/0!"},{"$error":"#DIV/0!"},{"$error":"#DIV/0!"},{"$error":"#DIV/0!"},{"$f":"IF(A30=\"m\",VLOOKUP(P30,Berechnung_Male!$A$1:$D$42,AA30,TRUE),VLOOKUP(Eingabeblatt!P30,Berechnung_Female!$A$1:$D$42,AA30,TRUE))","v":{"$error":"#DIV/0!"}},{"$error":"#DIV/0!"},null,null,null,{"$error":"#DIV/0!"}]
[null,null,null,null,null,null,null,0,null,null,null,0,0,0,{"$error":"#DIV/0!"},{"$error":"#DIV/0!"},{"$error":"#DIV/0!"},{"$error":"#DIV/0!"},{"$error":"#DIV/0!"},{"$error":"#DIV/0!"},{"$error":"#DIV/0!"},{"$f":"IF(A31=\"m\",VLOOKUP(P31,Berechnung_Male!$A$1:$D$42,AA31,TRUE),VLOOKUP(Eingabeblatt!P31,Berechnung_Female!$A$1:$D$42,AA31,TRUE))","v":{"$error":"#DIV/0!"}},{"$error":"#DIV/0!"},null,null,null,{"$error":"#DIV/0!"}]
[null,null,null,null,null,null,null,0,null,null,null,0,0,0,{"$error":"#DIV/0!"},{"$error":"#DIV/0!"},{"$error":"#DIV/0!"},{"$error":"#DIV/0!"},{"$error":"#DIV/0!"},{"$error":"#DIV/0!"},{"$error":"#DIV/0!"},{"$f":"IF(A32=\"m\",VLOOKUP(P32,Berechnung_Male!$A$1:$D$42,AA32,TRUE),VLOOKUP(Eingabeblatt!P32,Berechnung_Female!$A$1:$D$42,AA32,TRUE))","v":{"$error":"#DIV/0!"}},{"$error":"#DIV/0!"},null,null,null,{"$error":"#DIV/0!"}]
[null,null,null,null,null,null,null,0,null,null,null,0,0,0,{"$error":"#DIV/0!"},{"$error":"#DIV/0!"},{"$error":"#DIV/0!"},{"$error":"#DIV/0!"},{"$error":"#DIV/0!"},{"$error":"#DIV/0!"},{"$error":"#DIV/0!"},{"$f":"IF(A33=\"m\",VLOOKUP(P33,Berechnung_Male!$A$1:$D$42,AA33,TRUE),VLOOKUP(Eingabeblatt!P33,Berechnung_Female!$A$1:$D$42,AA33,TRUE))","v":{"$error":"#DIV/0!"}},{"$error":"#DIV/0!"},null,null,null,{"$error":"#DIV/0!"}]
[null,null,null,null,null,null,null,0,null,null,null,0,0,0,{"$error":"#DIV/0!"},{"$error":"#DIV/0!"},{"$error":"#DIV/0!"},{"$error":"#DIV/0!"},{"$error":"#DIV/0!"},{"$error":"#DIV/0!"},{"$error":"#DIV/0!"},{"$f":"IF(A34=\"m\",VLOOKUP(P34,Berechnung_Male!$A$1:$D$42,AA34,TRUE),VLOOKUP(Eingabeblatt!P34,Berechnung_Female!$A$1:$D$42,AA34,TRUE))","v":{"$error":"#DIV/0!"}},{"$error":"#DIV/0!"},null,null,null,{"$error":"#DIV/0!"}]
[null,null,null,null,null,null,null,0,null,null,null,0,0,0,{"$error":"#DIV/0!"},{"$error":"#DIV/0!"},{"$error":"#DIV/0!"},{"$error":"#DIV/0!"},{"$error":"#DIV/0!"},{"$error":"#DIV/0!"},{"$error":"#DIV/0!"},{"$f":"IF(A35=\"m\",VLOOKUP(P35,Berechnung_Male!$A$1:$D$42,AA35,TRUE),VLOOKUP(Eingabeblatt!P35,Berechnung_Female!$A$1:$D$42,AA35,TRUE))","v":{"$error":"#DIV/0!"}},{"$error":"#DIV/0!"},null,null,null,{"$error":"#DIV/0!"}]
[null,null,null,null,null,null,null,0,null,null,null,0,0,0,{"$error":"#DIV/0!"},{"$error":"#DIV/0!"},{"$error":"#DIV/0!"},{"$error":"#DIV/0!"},{"$error":"#DIV/0!"},{"$error":"#DIV/0!"},{"$error":"#DIV/0!"},{"$f":"IF(A36=\"m\",VLOOKUP(P36,Berechnung_Male!$A$1:$D$42,AA36,TRUE),VLOOKUP(Eingabeblatt!P36,Berechnung_Female!$A$1:$D$42,AA36,TRUE))","v":{"$error":"#DIV/0!"}},{"$error":"#DIV/0!"},null,null,null,{"$error":"#DIV/0!"}]
[null,null,null,null,null,null,null,0,null,null,null,0,0,0,{"$error":"#DIV/0!"},{"$error":"#DIV/0!"},{"$error":"#DIV/0!"},{"$error":"#DIV/0!"},{"$error":"#DIV/0!"},{"$error":"#DIV/0!"},{"$error":"#DIV/0!"},{"$f":"IF(A37=\"m\",VLOOKUP(P37,Berechnung_Male!$A$1:$D$42,AA37,TRUE),VLOOKUP(Eingabeblatt!P37,Berechnung_Female!$A$1:$D$42,AA37,TRUE))","v":{"$error":"#DIV/0!"}},{"$error":"#DIV/0!"},null,null,null,{"$error":"#DIV/0!"}]
[null,null,null,null,null,null,null,0,null,null,null,0,0,0,{"$error":"#DIV/0!"},{"$error":"#DIV/0!"},{"$error":"#DIV/0!"},{"$error":"#DIV/0!"},{"$error":"#DIV/0!"},{"$error":"#DIV/0!"},{"$error":"#DIV/0!"},{"$f":"IF(A38=\"m\",VLOOKUP(P38,Berechnung_Male!$A$1:$D$42,AA38,TRUE),VLOOKUP(Eingabeblatt!P38,Berechnung_Female!$A$1:$D$42,AA38,TRUE))","v":{"$error":"#DIV/0!"}},{"$error":"#DIV/0!"},null,null,null,{"$error":"#DIV/0!"}]
[null,null,null,null,null,null,null,0,null,null,null,0,0,0,{"$error":"#DIV/0!"},{"$error":"#DIV/0!"},{"$error":"#DIV/0!"},{"$error":"#DIV/0!"},{"$error":"#DIV/0!"},{"$error":"#DIV/0!"},{"$error":"#DIV/0!"},{"$f":"IF(A39=\"m\",VLOOKUP(P39,Berechnung_Male!$A$1:$D$42,AA39,TRUE),VLOOKUP(Eingabeblatt!P39,Berechnung_Female!$A$1:$D$42,AA39,TRUE))","v":{"$error":"#DIV/0!"}},{"$error":"#DIV/0!"},null,null,null,{"$error":"#DIV/0!"}]
[null,null,null,null,null,null,null,0,null,null,null,0,0,0,{"$error":"#DIV/0!"},{"$error":"#DIV/0!"},{"$error":"#DIV/0!"},{"$error":"#DIV/0!"},{"$error":"#DIV/0!"},{"$error":"#DIV/0!"},{"$error":"#DIV/0!"},{"$f":"IF(A40=\"m\",VLOOKUP(P40,Berechnung_Male!$A$1:$D$42,AA40,TRUE),VLOOKUP(Eingabeblatt!P40,Berechnung_Female!$A$1:$D$42,AA40,TRUE))","v":{"$error":"#DIV/0!"}},{"$error":"#DIV/0!"},null,null,null,{"$error":"#DIV/0!"}]
[null,null,null,null,null,null,null,0,null,null,null,0,0,0,{"$error":"#DIV/0!"},{"$error":"#DIV/0!"},{"$error":"#DIV/0!"},{"$error":"#DIV/0!"},{"$error":"#DIV/0!"},{"$error":"#DIV/0!"},{"$error":"#DIV/0!"},{"$f":"IF(A41=\"m\",VLOOKUP(P41,Berechnung_Male!$A$1:$D$42,AA41,TRUE),VLOOKUP(Eingabeblatt!P41,Berechnung_Female!$A$1:$D$42,AA41,TRUE))","v":{"$error":"#DIV/0!"}},{"$error":"#DIV/0!"},null,null,null,{"$error":"#DIV/0!"}]
[null,null,null,null,null,null,null,0,null,null,null,0,0,0,{"$error":"#DIV/0!"},{"$error":"#DIV/0!"},{"$error":"#DIV/0!"},{"$error":"#DIV/0!"},{"$error":"#DIV/0!"},{"$error":"#DIV/0!"},{"$error":"#DIV/0!"},{"$f":"IF(A42=\"m\",VLOOKUP(P42,Berechnung_Male!$A$1:$D$42,AA42,TRUE),VLOOKUP(Eingabeblatt!P42,Berechnung_Female!$A$1:$D$42,AA42,TRUE))","v":{"$error":"#DIV/0!"}},{"$error":"#DIV/0!"},null,null,null,{"$error":"#DIV/0!"}]
[null,null,null,null,null,null,null,0,null,null,null,0,0,0,{"$error":"#DIV/0!"},{"$error":"#DIV/0!"},{"$error":"#DIV/0!"},{"$error":"#DIV/0!"},{"$error":"#DIV/0!"},{"$error":"#DIV/0!"},{"$error":"#DIV/0!"},{"$f":"IF(A43=\"m\",VLOOKUP(P43,Berechnung_Male!$A$1:$D$42,AA43,TRUE),VLOOKUP(Eingabeblatt!P43,Berechnung_Female!$A$1:$D$42,AA43,TRUE))","v":{"$error":"#DIV/0!"}},{"$error":"#DIV/0!"},null,null,null,{"$error":"#DIV/0!"}]
[null,null,null,null,null,null,null,0,null,null,null,0,0,0,{"$error":"#DIV/0!"},{"$error":"#DIV/0!"},{"$error":"#DIV/0!"},{"$error":"#DIV/0!"},{"$error":"#DIV/0!"},{"$error":"#DIV/0!"},{"$error":"#DIV/0!"},{"$f":"IF(A44=\"m\",VLOOKUP(P44,Berechnung_Male!$A$1:$D$42,AA44,TRUE),VLOOKUP(Eingabeblatt!P44,Berechnung_Female!$A$1:$D$42,AA44,TRUE))","v":{"$error":"#DIV/0!"}},{"$error":"#DIV/0!"},null,null,null,{"$error":"#DIV/0!"}]
[null,null,null,null,null,null,null,0,null,null,null,0,0,0,{"$error":"#DIV/0!"},{"$error":"#DIV/0!"},{"$error":"#DIV/0!"},{"$error":"#DIV/0!"},{"$error":"#DIV/0!"},{"$error":"#DIV/0!"},{"$error":"#DIV/0!"},{"$f":"IF(A45=\"m\",VLOOKUP(P45,Berechnung_Male!$A$1:$D$42,AA45,TRUE),VLOOKUP(Eingabeblatt!P45,Berechnung_Female!$A$1:$D$42,AA45,TRUE))","v":{"$error":"#DIV/0!"}},{"$error":"#DIV/0!"},null,null,null,{"$error":"#DIV/0!"}]
[null,null,null,null,null,null,null,0,null,null,null,0,0,0,{"$error":"#DIV/0!"},{"$error":"#DIV/0!"},{"$error":"#DIV/0!"},{"$error":"#DIV/0!"},{"$error":"#DIV/0!"},{"$error":"#DIV/0!"},{"$error":"#DIV/0!"},{"$f":"IF(A46=\"m\",VLOOKUP(P46,Berechnung_Male!$A$1:$D$42,AA46,TRUE),VLOOKUP(Eingabeblatt!P46,Berechnung_Female!$A$1:$D$42,AA46,TRUE))","v":{"$error":"#DIV/0!"}},{"$error":"#DIV/0!"},null,null,null,{"$error":"#DIV/0!"}]
[null,null,null,null,null,null,null,0,null,null,null,0,0,0,{"$error":"#DIV/0!"},{"$error":"#DIV/0!"},{"$error":"#DIV/0!"},{"$error":"#DIV/0!"},{"$error":"#DIV/0!"},{"$error":"#DIV/0!"},{"$error":"#DIV/0!"},{"$f":"IF(A47=\"m\",VLOOKUP(P47,Berechnung_Male!$A$1:$D$42,AA47,TRUE),VLOOKUP(Eingabeblatt!P47,Berechnung_Female!$A$1:$D$42,AA47,TRUE))","v":{"$error":"#DIV/0!"}},{"$error":"#DIV/0!"},null,null,null,{"$error":"#DIV/0!"}]
[null,null,null,null,null,null,null,0,null,null,null,0,0,0,{"$error":"#DIV/0!"},{"$error":"#DIV/0!"},{"$error":"#DIV/0!"},{"$error":"#DIV/0!"},{"$error":"#DIV/0!"},{"$error":"#DIV/0!"},{"$error":"#DIV/0!"},{"$f":"IF(A48=\"m\",VLOOKUP(P48,Berechnung_Male!$A$1:$D$42,AA48,TRUE),VLOOKUP(Eingabeblatt!P48,Berechnung_Female!$A$1:$D$42,AA48,TRUE))","v":{"$error":"#DIV/0!"}},{"$error":"#DIV/0!"},null,null,null,{"$error":"#DIV/0!"}]
[null,null,null,null,null,null,null,0,null,null,null,0,0,0,{"$error":"#DIV/0!"},{"$error":"#DIV/0!"},{"$error":"#DIV/0!"},{"$error":"#DIV/0!"},{"$error":"#DIV/0!"},{"$error":"#DIV/0!"},{"$error":"#DIV/0!"},{"$f":"IF(A49=\"m\",VLOOKUP(P49,Berechnung_Male!$A$1:$D$42,AA49,TRUE),VLOOKUP(Eingabeblatt!P49,Berechnung_Female!$A$1:$D$42,AA49,TRUE))","v":{"$error":"#DIV/0!"}},{"$error":"#DIV/0!"},null,null,null,{"$error":"#DIV/0!"}]
[null,null,null,null,null,null,null,0,null,null,null,0,0,0,{"$error":"#DIV/0!"},{"$error":"#DIV/0!"},{"$error":"#DIV/0!"},{"$error":"#DIV/0!"},{"$error":"#DIV/0!"},{"$error":"#DIV/0!"},{"$error":"#DIV/0!"},{"$f":"IF(A50=\"m\",VLOOKUP(P50,Berechnung_Male!$A$1:$D$42,AA50,TRUE),VLOOKUP(Eingabeblatt!P50,Berechnung_Female!$A$1:$D$42,AA50,TRUE))","v":{"$error":"#DIV/0!"}},{"$error":"#DIV/0!"},null,null,null,{"$error":"#DIV/0!"}]
[null,null,null,null,null,null,null,0,null,null,null,0,0,0,{"$error":"#DIV/0!"},{"$error":"#DIV/0!"},{"$error":"#DIV/0!"},{"$error":"#DIV/0!"},{"$error":"#DIV/0!"},{"$error":"#DIV/0!"},{"$error":"#DIV/0!"},{"$f":"IF(A51=\"m\",VLOOKUP(P51,Berechnung_Male!$A$1:$D$42,AA51,TRUE),VLOOKUP(Eingabeblatt!P51,Berechnung_Female!$A$1:$D$42,AA51,TRUE))","v":{"$error":"#DIV/0!"}},{"$error":"#DIV/0!"},null,null,null,{"$error":"#DIV/0!"}]
[null,null,null,null,null,null,null,0,null,null,null,0,0,0,{"$error":"#DIV/0!"},{"$error":"#DIV/0!"},{"$error":"#DIV/0!"},{"$error":"#DIV/0!"},{"$error":"#DIV/0!"},{"$error":"#DIV/0!"},{"$error":"#DIV/0!"},{"$f":"IF(A52=\"m\",VLOOKUP(P52,Berechnung_Male!$A$1:$D$42,AA52,TRUE),VLOOKUP(Eingabeblatt!P52,Berechnung_Female!$A$1:$D$42,AA52,TRUE))","v":{"$error":"#DIV/0!"}},{"$error":"#DIV/0!"},null,null,null,{"$error":"#DIV/0!"}]
[null,null,null,null,null,null,null,0,null,null,null,0,0,0,{"$error":"#DIV/0!"},{"$error":"#DIV/0!"},{"$error":"#DIV/0!"},{"$error":"#DIV/0!"},{"$error":"#DIV/0!"},{"$error":"#DIV/0!"},{"$error":"#DIV/0!"},{"$f":"IF(A53=\"m\",VLOOKUP(P53,Berechnung_Male!$A$1:$D$42,AA53,TRUE),VLOOKUP(Eingabeblatt!P53,Berechnung_Female!$A$1:$D$42,AA53,TRUE))","v":{"$error":"#DIV/0!"}},{"$error":"#DIV/0!"},null,null,null,{"$error":"#DIV/0!"}]
[null,null,null,null,null,null,null,0,null,null,null,0,0,0,{"$error":"#DIV/0!"},{"$error":"#DIV/0!"},{"$error":"#DIV/0!"},{"$error":"#DIV/0!"},{"$error":"#DIV/0!"},{"$error":"#DIV/0!"},{"$error":"#DIV/0!"},{"$f":"IF(A54=\"m\",VLOOKUP(P54,Berechnung_Male!$A$1:$D$42,AA54,TRUE),VLOOKUP(Eingabeblatt!P54,Berechnung_Female!$A$1:$D$42,AA54,TRUE))","v":{"$error":"#DIV/0!"}},{"$error":"#DIV/0!"},null,null,null,{"$error":"#DIV/0!"}]
[null,null,null,null,null,null,null,0,null,null,null,0,0,0,{"$error":"#DIV/0!"},{"$error":"#DIV/0!"},{"$error":"#DIV/0!"},{"$error":"#DIV/0!"},{"$error":"#DIV/0!"},{"$error":"#DIV/0!"},{"$error":"#DIV/0!"},{"$f":"IF(A55=\"m\",VLOOKUP(P55,Berechnung_Male!$A$1:$D$42,AA55,TRUE),VLOOKUP(Eingabeblatt!P55,Berechnung_Female!$A$1:$D$42,AA55,TRUE))","v":{"$error":"#DIV/0!"}},{"$error":"#DIV/0!"},null,null,null,{"$error":"#DIV/0!"}]
[null,null,null,null,null,null,null,0,null,null,null,0,0,0,{"$error":"#DIV/0!"},{"$error":"#DIV/0!"},{"$error":"#DIV/0!"},{"$error":"#DIV/0!"},{"$error":"#DIV/0!"},{"$error":"#DIV/0!"},{"$error":"#DIV/0!"},{"$f":"IF(A56=\"m\",VLOOKUP(P56,Berechnung_Male!$A$1:$D$42,AA56,TRUE),VLOOKUP(Eingabeblatt!P56,Berechnung_Female!$A$1:$D$42,AA56,TRUE))","v":{"$error":"#DIV/0!"}},{"$error":"#DIV/0!"},null,null,null,{"$error":"#DIV/0!"}]
[null,null,null,null,null,null,null,0,null,null,null,0,0,0,{"$error":"#DIV/0!"},{"$error":"#DIV/0!"},{"$error":"#DIV/0!"},{"$error":"#DIV/0!"},{"$error":"#DIV/0!"},{"$error":"#DIV/0!"},{"$error":"#DIV/0!"},{"$f":"IF(A57=\"m\",VLOOKUP(P57,Berechnung_Male!$A$1:$D$42,AA57,TRUE),VLOOKUP(Eingabeblatt!P57,Berechnung_Female!$A$1:$D$42,AA57,TRUE))","v":{"$error":"#DIV/0!"}},{"$error":"#DIV/0!"},null,null,null,{"$error":"#DIV/0!"}]
[null,null,null,null,null,null,null,0,null,null,null,0,0,0,{"$error":"#DIV/0!"},{"$error":"#DIV/0!"},{"$error":"#DIV/0!"},{"$error":"#DIV/0!"},{"$error":"#DIV/0!"},{"$error":"#DIV/0!"},{"$error":"#DIV/0!"},{"$f":"IF(A58=\"m\",VLOOKUP(P58,Berechnung_Male!$A$1:$D$42,AA58,TRUE),VLOOKUP(Eingabeblatt!P58,Berechnung_Female!$A$1:$D$42,AA58,TRUE))","v":{"$error":"#DIV/0!"}},{"$error":"#DIV/0!"},null,null,null,{"$error":"#DIV/0!"}]
[null,null,null,null,null,null,null,0,null,null,null,0,0,0,{"$error":"#DIV/0!"},{"$error":"#DIV/0!"},{"$error":"#DIV/0!"},{"$error":"#DIV/0!"},{"$error":"#DIV/0!"},{"$error":"#DIV/0!"},{"$error":"#DIV/0!"},{"$f":"IF(A59=\"m\",VLOOKUP(P59,Berechnung_Male!$A$1:$D$42,AA59,TRUE),VLOOKUP(Eingabeblatt!P59,Berechnung_Female!$A$1:$D$42,AA59,TRUE))","v":{"$error":"#DIV/0!"}},{"$error":"#DIV/0!"},null,null,null,{"$error":"#DIV/0!"}]
[null,null,null,null,null,null,null,0,null,null,null,0,0,0,{"$error":"#DIV/0!"},{"$error":"#DIV/0!"},{"$error":"#DIV/0!"},{"$error":"#DIV/0!"},{"$error":"#DIV/0!"},{"$error":"#DIV/0!"},{"$error":"#DIV/0!"},{"$f":"IF(A60=\"m\",VLOOKUP(P60,Berechnung_Male!$A$1:$D$42,AA60,TRUE),VLOOKUP(Eingabeblatt!P60,Berechnung_Female!$A$1:$D$42,AA60,TRUE))","v":{"$error":"#DIV/0!"}},{"$error":"#DIV/0!"},null,null,null,{"$error":"#DIV/0!"}]
[null,null,null,null,null,null,null,0,null,null,null,0,0,0,{"$error":"#DIV/0!"},{"$error":"#DIV/0!"},{"$error":"#DIV/0!"},{"$error":"#DIV/0!"},{"$error":"#DIV/0!"},{"$error":"#DIV/0!"},{"$error":"#DIV/0!"},{"$f":"IF(A61=\"m\",VLOOKUP(P61,Berechnung_Male!$A$1:$D$42,AA61,TRUE),VLOOKUP(Eingabeblatt!P61,Berechnung_Female!$A$1:$D$42,AA61,TRUE))","v":{"$error":"#DIV/0!"}},{"$error":"#DIV/0!"},null,null,null,{"$error":"#DIV/0!"}]
[null,null,null,null,null,null,null,0,null,null,null,0,0,0,{"$error":"#DIV/0!"},{"$error":"#DIV/0!"},{"$error":"#DIV/0!"},{"$error":"#DIV/0!"},{"$error":"#DIV/0!"},{"$error":"#DIV/0!"},{"$error":"#DIV/0!"},{"$f":"IF(A62=\"m\",VLOOKUP(P62,Berechnung_Male!$A$1:$D$42,AA62,TRUE),VLOOKUP(Eingabeblatt!P62,Berechnung_Female!$A$1:$D$42,AA62,TRUE))","v":{"$error":"#DIV/0!"}},{"$error":"#DIV/0!"},null,null,null,{"$error":"#DIV/0!"}]
[null,null,null,null,null,null,null,0,null,null,null,0,0,0,{"$error":"#DIV/0!"},{"$error":"#DIV/0!"},{"$error":"#DIV/0!"},{"$error":"#DIV/0!"},{"$error":"#DIV/0!"},{"$error":"#DIV/0!"},{"$error":"#DIV/0!"},{"$f":"IF(A63=\"m\",VLOOKUP(P63,Berechnung_Male!$A$1:$D$42,AA63,TRUE),VLOOKUP(Eingabeblatt!P63,Berechnung_Female!$A$1:$D$42,AA63,TRUE))","v":{"$error":"#DIV/0!"}},{"$error":"#DIV/0!"},null,null,null,{"$error":"#DIV/0!"}]
[null,null,null,null,null,null,null,0,null,null,null,0,0,0,{"$error":"#DIV/0!"},{"$error":"#DIV/0!"},{"$error":"#DIV/0!"},{"$error":"#DIV/0!"},{"$error":"#DIV/0!"},{"$error":"#DIV/0!"},{"$error":"#DIV/0!"},{"$f":"IF(A64=\"m\",VLOOKUP(P64,Berechnung_Male!$A$1:$D$42,AA64,TRUE),VLOOKUP(Eingabeblatt!P64,Berechnung_Female!$A$1:$D$42,AA64,TRUE))","v":{"$error":"#DIV/0!"}},{"$error":"#DIV/0!"},null,null,null,{"$error":"#DIV/0!"}]
[null,null,null,null,null,null,null,0,null,null,null,0,0,0,{"$error":"#DIV/0!"},{"$error":"#DIV/0!"},{"$error":"#DIV/0!"},{"$error":"#DIV/0!"},{"$error":"#DIV/0!"},{"$error":"#DIV/0!"},{"$error":"#DIV/0!"},{"$f":"IF(A65=\"m\",VLOOKUP(P65,Berechnung_Male!$A$1:$D$42,AA65,TRUE),VLOOKUP(Eingabeblatt!P65,Berechnung_Female!$A$1:$D$42,AA65,TRUE))","v":{"$error":"#DIV/0!"}},{"$error":"#DIV/0!"},null,null,null,{"$error":"#DIV/0!"}]
[null,null,null,null,null,null,null,0,null,null,null,0,0,0,{"$error":"#DIV/0!"},{"$error":"#DIV/0!"},{"$error":"#DIV/0!"},{"$error":"#DIV/0!"},{"$error":"#DIV/0!"},{"$error":"#DIV/0!"},{"$error":"#DIV/0!"},{"$f":"IF(A66=\"m\",VLOOKUP(P66,Berechnung_Male!$A$1:$D$42,AA66,TRUE),VLOOKUP(Eingabeblatt!P66,Berechnung_Female!$A$1:$D$42,AA66,TRUE))","v":{"$error":"#DIV/0!"}},{"$error":"#DIV/0!"},null,null,null,{"$error":"#DIV/0!"}]
[null,null,null,null,null,null,null,0,null,null,null,0,0,0,{"$error":"#DIV/0!"},{"$error":"#DIV/0!"},{"$error":"#DIV/0!"},{"$error":"#DIV/0!"},{"$error":"#DIV/0!"},{"$error":"#DIV/0!"},{"$error":"#DIV/0!"},{"$f":"IF(A67=\"m\",VLOOKUP(P67,Berechnung_Male!$A$1:$D$42,AA67,TRUE),VLOOKUP(Eingabeblatt!P67,Berechnung_Female!$A$1:$D$42,AA67,TRUE))","v":{"$error":"#DIV/0!"}},{"$error":"#DIV/0!"},null,null,null,{"$error":"#DIV/0!"}]
[null,null,null,null,null,null,null,0,null,null,null,0,0,0,{"$error":"#DIV/0!"},{"$error":"#DIV/0!"},{"$error":"#DIV/0!"},{"$error":"#DIV/0!"},{"$error":"#DIV/0!"},{"$error":"#DIV/0!"},{"$error":"#DIV/0!"},{"$f":"IF(A68=\"m\",VLOOKUP(P68,Berechnung_Male!$A$1:$D$42,AA68,TRUE),VLOOKUP(Eingabeblatt!P68,Berechnung_Female!$A$1:$D$42,AA68,TRUE))","v":{"$error":"#DIV/0!"}},{"$error":"#DIV/0!"},null,null,null,{"$error":"#DIV/0!"}]
[null,null,null,null,null,null,null,0,null,null,null,0,0,0,{"$error":"#DIV/0!"},{"$error":"#DIV/0!"},{"$error":"#DIV/0!"},{"$error":"#DIV/0!"},{"$f":"IF(A69=\"m\",(IF(O69<12.8,1,IF(O69<13.3,2,IF(O69>14.8,5,IF(O69>14.3,4,3))))),(IF(O69<11,1,IF(O69<11.5,2,IF(O69>13,5,IF(O69>12.5,4,3))))))","v":{"$error":"#DIV/0!"}},{"$error":"#DIV/0!"},{"$error":"#DIV/0!"},{"$f":"IF(A69=\"m\",VLOOKUP(P69,Berechnung_Male!$A$1:$D$42,AA69,TRUE),VLOOKUP(Eingabeblatt!P69,Berechnung_Female!$A$1:$D$42,AA69,TRUE))","v":{"$error":"#DIV/0!"}},{"$error":"#DIV/0!"},null,null,null,{"$f":"IF(A69=\"m\",IF(O69<12.8,2,IF(O69<14.8,3,4)),IF(O69<11,2,IF(O69<13,3,4)))","v":{"$error":"#DIV/0!"}}]
[null,null,null,null,null,null,null,{"$f":"F70-G70","v":0},null,null,null,{"$f":"J70-K70","v":0},{"$f":"I70-L70","v":0},{"$f":"(B70-E70)/365.25","v":0},{"$f":"N70-P70","v":{"$error":"#DIV/0!"}},{"$f":"IF(A70=\"m\",(-9.236+(0.0002708*M70*L70)+(-0.001663*N70*M70)+(0.007216*N70*L70)+(0.02292*H70/I70*100)),(-9.376+(0.0001882*M70*L70)+(0.0022*N70*M70)+(0.005841*N70*L70)-(0.002658*N70*H70)+(0.07693*(H70/I70)*100)))","v":{"$error":"#DIV/0!"}},{"$f":"IF(R70=1,\"Früh / précoce\",IF(R70=2,\"Durchschnittlich / Normal\",\"Spät / Tardif\"))","v":{"$error":"#DIV/0!"}},{"$f":"IF(A70=\"m\",(IF(O70<12.8,1,IF(O70>14.8,3,2))),(IF(O70<11,1,IF(O70>13,3,2))))","v":{"$error":"#DIV/0!"}},{"$error":"#DIV/0!"},{"$f":"IF(S70=1,\"Früh / précoce\",IF(S70=2,\"Möglicherweise Früh / éventuellement précoce\", IF(S70=3,\"Durchschnittlich / Normal\",IF(S70=4,\"Möglicherweise spät / éventuellement tardif\",\"Spät / Tardif\"))))","v":{"$error":"#DIV/0!"}},{"$f":"I70+V70","v":{"$error":"#DIV/0!"}},{"$f":"IF(A70=\"m\",VLOOKUP(P70,Berechnung_Male!$A$1:$D$42,AA70,TRUE),VLOOKUP(Eingabeblatt!P70,Berechnung_Female!$A$1:$D$42,AA70,TRUE))","v":{"$error":"#DIV/0!"}},{"$f":"I70/U70","v":{"$error":"#DIV/0!"}},null,null,null,{"$error":"#DIV/0!"}]
[null,null,null,null,null,null,null,0,null,null,null,0,0,0,{"$error":"#DIV/0!"},{"$error":"#DIV/0!"},{"$error":"#DIV/0!"},{"$error":"#DIV/0!"},{"$error":"#DIV/0!"},{"$error":"#DIV/0!"},{"$error":"#DIV/0!"},{"$f":"IF(A71=\"m\",VLOOKUP(P71,Berechnung_Male!$A$1:$D$42,AA71,TRUE),VLOOKUP(Eingabeblatt!P71,Berechnung_Female!$A$1:$D$42,AA71,TRUE))","v":{"$error":"#DIV/0!"}},{"$error":"#DIV/0!"},null,null,null,{"$error":"#DIV/0!"}]
[null,null,null,null,null,null,null,0,null,null,null,0,0,0,{"$error":"#DIV/0!"},{"$error":"#DIV/0!"},{"$error":"#DIV/0!"},{"$error":"#DIV/0!"},{"$error":"#DIV/0!"},{"$error":"#DIV/0!"},{"$error":"#DIV/0!"},{"$f":"IF(A72=\"m\",VLOOKUP(P72,Berechnung_Male!$A$1:$D$42,AA72,TRUE),VLOOKUP(Eingabeblatt!P72,Berechnung_Female!$A$1:$D$42,AA72,TRUE))","v":{"$error":"#DIV/0!"}},{"$error":"#DIV/0!"},null,null,null,{"$error":"#DIV/0!"}]
[null,null,null,null,null,null,null,0,null,null,null,0,0,0,{"$error":"#DIV/0!"},{"$error":"#DIV/0!"},{"$error":"#DIV/0!"},{"$error":"#DIV/0!"},{"$error":"#DIV/0!"},{"$error":"#DIV/0!"},{"$error":"#DIV/0!"},{"$f":"IF(A73=\"m\",VLOOKUP(P73,Berechnung_Male!$A$1:$D$42,AA73,TRUE),VLOOKUP(Eingabeblatt!P73,Berechnung_Female!$A$1:$D$42,AA73,TRUE))","v":{"$error":"#DIV/0!"}},{"$error":"#DIV/0!"},null,null,null,{"$error":"#DIV/0!"}]
[null,null,null,null,null,null,null,0,null,null,null,0,0,0,{"$error":"#DIV/0!"},{"$error":"#DIV/0!"},{"$error":"#DIV/0!"},{"$error":"#DIV/0!"},{"$error":"#DIV/0!"},{"$error":"#DIV/0!"},{"$error":"#DIV/0!"},{"$f":"IF(A74=\"m\",VLOOKUP(P74,Berechnung_Male!$A$1:$D$42,AA74,TRUE),VLOOKUP(Eingabeblatt!P74,Berechnung_Female!$A$1:$D$42,AA74,TRUE))","v":{"$error":"#DIV/0!"}},{"$error":"#DIV/0!"},null,null,null,{"$error":"#DIV/0!"}]
[null,null,null,null,null,null,null,0,null,null,null,0,0,0,{"$error":"#DIV/0!"},{"$error":"#DIV/0!"},{"$error":"#DIV/0!"},{"$error":"#DIV/0!"},{"$error":"#DIV/0!"},{"$error":"#DIV/0!"},{"$error":"#DIV/0!"},{"$f":"IF(A75=\"m\",VLOOKUP(P75,Berechnung_Male!$A$1:$D$42,AA75,TRUE),VLOOKUP(Eingabeblatt!P75,Berechnung_Female!$A$1:$D$42,AA75,TRUE))","v":{"$error":"#DIV/0!"}},{"$error":"#DIV/0!"},null,null,null,{"$error":"#DIV/0!"}]
[null,null,null,null,null,null,null,0,null,null,null,0,0,0,{"$error":"#DIV/0!"},{"$error":"#DIV/0!"},{"$error":"#DIV/0!"},{"$error":"#DIV/0!"},{"$error":"#DIV/0!"},{"$error":"#DIV/0!"},{"$error":"#DIV/0!"},{"$f":"IF(A76=\"m\",VLOOKUP(P76,Berechnung_Male!$A$1:$D$42,AA76,TRUE),VLOOKUP(Eingabeblatt!P76,Berechnung_Female!$A$1:$D$42,AA76,TRUE))","v":{"$error":"#DIV/0!"}},{"$error":"#DIV/0!"},null,null,null,{"$error":"#DIV/0!"}]
[null,null,null,null,null,null,null,0,null,null,null,0,0,0,{"$error":"#DIV/0!"},{"$error":"#DIV/0!"},{"$error":"#DIV/0!"},{"$error":"#DIV/0!"},{"$error":"#DIV/0!"},{"$error":"#DIV/0!"},{"$error":"#DIV/0!"},{"$f":"IF(A77=\"m\",VLOOKUP(P77,Berechnung_Male!$A$1:$D$42,AA77,TRUE),VLOOKUP(Eingabeblatt!P77,Berechnung_Female!$A$1:$D$42,AA77,TRUE))","v":{"$error":"#DIV/0!"}},{"$error":"#DIV/0!"},null,null,null,{"$error":"#DIV/0!"}]
[null,null,null,null,null,null,null,0,null,null,null,0,0,0,{"$error":"#DIV/0!"},{"$error":"#DIV/0!"},{"$error":"#DIV/0!"},{"$error":"#DIV/0!"},{"$error":"#DIV/0!"},{"$error":"#DIV/0!"},{"$error":"#DIV/0!"},{"$f":"IF(A78=\"m\",VLOOKUP(P78,Berechnung_Male!$A$1:$D$42,AA78,TRUE),VLOOKUP(Eingabeblatt!P78,Berechnung_Female!$A$1:$D$42,AA78,TRUE))","v":{"$error":"#DIV/0!"}},{"$error":"#DIV/0!"},null,null,null,{"$error":"#DIV/0!"}]
[null,null,null,null,null,null,null,0,null,null,null,0,0,0,{"$error":"#DIV/0!"},{"$error":"#DIV/0!"},{"$error":"#DIV/0!"},{"$error":"#DIV/0!"},{"$error":"#DIV/0!"},{"$error":"#DIV/0!"},{"$error":"#DIV/0!"},{"$f":"IF(A79=\"m\",VLOOKUP(P79,Berechnung_Male!$A$1:$D$42,AA79,TRUE),VLOOKUP(Eingabeblatt!P79,Berechnung_Female!$A$1:$D$42,AA79,TRUE))","v":{"$error":"#DIV/0!"}},{"$error":"#DIV/0!"},null,null,null,{"$error":"#DIV/0!"}]
[null,null,null,null,null,null,null,0,null,null,null,0,0,0,{"$error":"#DIV/0!"},{"$error":"#DIV/0!"},{"$error":"#DIV/0!"},{"$error":"#DIV/0!"},{"$error":"#DIV/0!"},{"$error":"#DIV/0!"},{"$error":"#DIV/0!"},{"$f":"IF(A80=\"m\",VLOOKUP(P80,Berechnung_Male!$A$1:$D$42,AA80,TRUE),VLOOKUP(Eingabeblatt!P80,Berechnung_Female!$A$1:$D$42,AA80,TRUE))","v":{"$error":"#DIV/0!"}},{"$error":"#DIV/0!"},null,null,null,{"$error":"#DIV/0!"}]
[null,null,null,null,null,null,null,0,null,null,null,0,0,0,{"$error":"#DIV/0!"},{"$error":"#DIV/0!"},{"$error":"#DIV/0!"},{"$error":"#DIV/0!"},{"$error":"#DIV/0!"},{"$error":"#DIV/0!"},{"$error":"#DIV/0!"},{"$f":"IF(A81=\"m\",VLOOKUP(P81,Berechnung_Male!$A$1:$D$42,AA81,TRUE),VLOOKUP(Eingabeblatt!P81,Berechnung_Female!$A$1:$D$42,AA81,TRUE))","v":{"$error":"#DIV/0!"}},{"$error":"#DIV/0!"},null,null,null,{"$error":"#DIV/0!"}]
[null,null,null,null,null,null,null,0,null,null,null,0,0,0,{"$error":"#DIV/0!"},{"$error":"#DIV/0!"},{"$error":"#DIV/0!"},{"$error":"#DIV/0!"},{"$error":"#DIV/0!"},{"$error":"#DIV/0!"},{"$error":"#DIV/0!"},{"$f":"IF(A82=\"m\",VLOOKUP(P82,Berechnung_Male!$A$1:$D$42,AA82,TRUE),VLOOKUP(Eingabeblatt!P82,Berechnung_Female!$A$1:$D$42,AA82,TRUE))","v":{"$error":"#DIV/0!"}},{"$error":"#DIV/0!"},null,null,null,{"$error":"#DIV/0!"}]
[null,null,null,null,null,null,null,0,null,null,null,0,0,0,{"$error":"#DIV/0!"},{"$error":"#DIV/0!"},{"$error":"#DIV/0!"},{"$error":"#DIV/0!"},{"$error":"#DIV/0!"},{"$error":"#DIV/0!"},{"$error":"#DIV/0!"},{"$f":"IF(A83=\"m\",VLOOKUP(P83,Berechnung_Male!$A$1:$D$42,AA83,TRUE),VLOOKUP(Eingabeblatt!P83,Berechnung_Female!$A$1:$D$42,AA83,TRUE))","v":{"$error":"#DIV/0!"}},{"$error":"#DIV/0!"},null,null,null,{"$error":"#DIV/0!"}]
[null,null,null,null,null,null,null,0,null,null,null,0,0,0,{"$error":"#DIV/0!"},{"$error":"#DIV/0!"},{"$error":"#DIV/0!"},{"$error":"#DIV/0!"},{"$error":"#DIV/0!"},{"$error":"#DIV/0!"},{"$error":"#DIV/0!"},{"$f":"IF(A84=\"m\",VLOOKUP(P84,Berechnung_Male!$A$1:$D$42,AA84,TRUE),VLOOKUP(Eingabeblatt!P84,Berechnung_Female!$A$1:$D$42,AA84,TRUE))","v":{"$error":"#DIV/0!"}},{"$error":"#DIV/0!"},null,null,null,{"$error":"#DIV/0!"}]
[null,null,null,null,null,null,null,0,null,null,null,0,0,0,{"$error":"#DIV/0!"},{"$error":"#DIV/0!"},{"$error":"#DIV/0!"},{"$error":"#DIV/0!"},{"$error":"#DIV/0!"},{"$error":"#DIV/0!"},{"$error":"#DIV/0!"},{"$f":"IF(A85=\"m\",VLOOKUP(P85,Berechnung_Male!$A$1:$D$42,AA85,TRUE),VLOOKUP(Eingabeblatt!P85,Berechnung_Female!$A$1:$D$42,AA85,TRUE))","v":{"$error":"#DIV/0!"}},{"$error":"#DIV/0!"},null,null,null,{"$error":"#DIV/0!"}]
[null,null,null,null,null,null,null,0,null,null,null,0,0,0,{"$error":"#DIV/0!"},{"$error":"#DIV/0!"},{"$error":"#DIV/0!"},{"$error":"#DIV/0!"},{"$error":"#DIV/0!"},{"$error":"#DIV/0!"},{"$error":"#DIV/0!"},{"$f":"IF(A86=\"m\",VLOOKUP(P86,Berechnung_Male!$A$1:$D$42,AA86,TRUE),VLOOKUP(Eingabeblatt!P86,Berechnung_Female!$A$1:$D$42,AA86,TRUE))","v":{"$error":"#DIV/0!"}},{"$error":"#DIV/0!"},null,null,null,{"$error":"#DIV/0!"}]
[null,null,null,null,null,null,null,0,null,null,null,0,0,0,{"$error":"#DIV/0!"},{"$error":"#DIV/0!"},{"$error":"#DIV/0!"},{"$error":"#DIV/0!"},{"$error":"#DIV/0!"},{"$error":"#DIV/0!"},{"$error":"#DIV/0!"},{"$f":"IF(A87=\"m\",VLOOKUP(P87,Berechnung_Male!$A$1:$D$42,AA87,TRUE),VLOOKUP(Eingabeblatt!P87,Berechnung_Female!$A$1:$D$42,AA87,TRUE))","v":{"$error":"#DIV/0!"}},{"$error":"#DIV/0!"},null,null,null,{"$error":"#DIV/0!"}]
[null,null,null,null,null,null,null,0,null,null,null,0,0,0,{"$error":"#DIV/0!"},{"$error":"#DIV/0!"},{"$error":"#DIV/0!"},{"$error":"#DIV/0!"},{"$error":"#DIV/0!"},{"$error":"#DIV/0!"},{"$error":"#DIV/0!"},{"$f":"IF(A88=\"m\",VLOOKUP(P88,Berechnung_Male!$A$1:$D$42,AA88,TRUE),VLOOKUP(Eingabeblatt!P88,Berechnung_Female!$A$1:$D$42,AA88,TRUE))","v":{"$error":"#DIV/0!"}},{"$error":"#DIV/0!"},null,null,null,{"$error":"#DIV/0!"}]
[null,null,null,null,null,null,null,0,null,null,null,0,0,0,{"$error":"#DIV/0!"},{"$error":"#DIV/0!"},{"$error":"#DIV/0!"},{"$error":"#DIV/0!"},{"$error":"#DIV/0!"},{"$error":"#DIV/0!"},{"$error":"#DIV/0!"},{"$f":"IF(A89=\"m\",VLOOKUP(P89,Berechnung_Male!$A$1:$D$42,AA89,TRUE),VLOOKUP(Eingabeblatt!P89,Berechnung_Female!$A$1:$D$42,AA89,TRUE))","v":{"$error":"#DIV/0!"}},{"$error":"#DIV/0!"},null,null,null,{"$error":"#DIV/0!"}]
[null,null,null,null,null,null,null,0,null,null,null,0,0,0,{"$error":"#DIV/0!"},{"$error":"#DIV/0!"},{"$error":"#DIV/0!"},{"$error":"#DIV/0!"},{"$error":"#DIV/0!"},{"$error":"#DIV/0!"},{"$error":"#DIV/0!"},{"$f":"IF(A90=\"m\",VLOOKUP(P90,Berechnung_Male!$A$1:$D$42,AA90,TRUE),VLOOKUP(Eingabeblatt!P90,Berechnung_Female!$A$1:$D$42,AA90,TRUE))","v":{"$error":"#DIV/0!"}},{"$error":"#DIV/0!"},null,null,null,{"$error":"#DIV/0!"}]
[null,null,null,null,null,null,null,0,null,null,null,0,0,0,{"$error":"#DIV/0!"},{"$error":"#DIV/0!"},{"$error":"#DIV/0!"},{"$error":"#DIV/0!"},{"$error":"#DIV/0!"},{"$error":"#DIV/0!"},{"$error":"#DIV/0!"},{"$f":"IF(A91=\"m\",VLOOKUP(P91,Berechnung_Male!$A$1:$D$42,AA91,TRUE),VLOOKUP(Eingabeblatt!P91,Berechnung_Female!$A$1:$D$42,AA91,TRUE))","v":{"$error":"#DIV/0!"}},{"$error":"#DIV/0!"},null,null,null,{"$error":"#DIV/0!"}]
[null,null,null,null,null,null,null,0,null,null,null,0,0,0,{"$error":"#DIV/0!"},{"$error":"#DIV/0!"},{"$error":"#DIV/0!"},{"$error":"#DIV/0!"},{"$error":"#DIV/0!"},{"$error":"#DIV/0!"},{"$error":"#DIV/0!"},{"$f":"IF(A92=\"m\",VLOOKUP(P92,Berechnung_Male!$A$1:$D$42,AA92,TRUE),VLOOKUP(Eingabeblatt!P92,Berechnung_Female!$A$1:$D$42,AA92,TRUE))","v":{"$error":"#DIV/0!"}},{"$error":"#DIV/0!"},null,null,null,{"$error":"#DIV/0!"}]
[null,null,null,null,null,null,null,0,null,null,null,0,0,0,{"$error":"#DIV/0!"},{"$error":"#DIV/0!"},{"$error":"#DIV/0!"},{"$error":"#DIV/0!"},{"$error":"#DIV/0!"},{"$error":"#DIV/0!"},{"$error":"#DIV/0!"},{"$f":"IF(A93=\"m\",VLOOKUP(P93,Berechnung_Male!$A$1:$D$42,AA93,TRUE),VLOOKUP(Eingabeblatt!P93,Berechnung_Female!$A$1:$D$42,AA93,TRUE))","v":{"$error":"#DIV/0!"}},{"$error":"#DIV/0!"},null,null,null,{"$error":"#DIV/0!"}]
[null,null,null,null,null,null,null,0,null,null,null,0,0,0,{"$error":"#DIV/0!"},{"$error":"#DIV/0!"},{"$error":"#DIV/0!"},{"$error":"#DIV/0!"},{"$error":"#DIV/0!"},{"$error":"#DIV/0!"},{"$error":"#DIV/0!"},{"$f":"IF(A94=\"m\",VLOOKUP(P94,Berechnung_Male!$A$1:$D$42,AA94,TRUE),VLOOKUP(Eingabeblatt!P94,Berechnung_Female!$A$1:$D$42,AA94,TRUE))","v":{"$error":"#DIV/0!"}},{"$error":"#DIV/0!"},null,null,null,{"$error":"#DIV/0!"}]
[null,null,null,null,null,null,null,0,null,null,null,0,0,0,{"$error":"#DIV/0!"},{"$error":"#DIV/0!"},{"$error":"#DIV/0!"},{"$error":"#DIV/0!"},{"$error":"#DIV/0!"},{"$error":"#DIV/0!"},{"$error":"#DIV/0!"},{"$f":"IF(A95=\"m\",VLOOKUP(P95,Berechnung_Male!$A$1:$D$42,AA95,TRUE),VLOOKUP(Eingabeblatt!P95,Berechnung_Female!$A$1:$D$42,AA95,TRUE))","v":{"$error":"#DIV/0!"}},{"$error":"#DIV/0!"},null,null,null,{"$error":"#DIV/0!"}]
[null,null,null,null,null,null,null,0,null,null,null,0,0,0,{"$error":"#DIV/0!"},{"$error":"#DIV/0!"},{"$error":"#DIV/0!"},{"$error":"#DIV/0!"},{"$error":"#DIV/0!"},{"$error":"#DIV/0!"},{"$error":"#DIV/0!"},{"$f":"IF(A96=\"m\",VLOOKUP(P96,Berechnung_Male!$A$1:$D$42,AA96,TRUE),VLOOKUP(Eingabeblatt!P96,Berechnung_Female!$A$1:$D$42,AA96,TRUE))","v":{"$error":"#DIV/0!"}},{"$error":"#DIV/0!"},null,null,null,{"$error":"#DIV/0!"}]
[null,null,null,null,null,null,null,0,null,null,null,0,0,0,{"$error":"#DIV/0!"},{"$error":"#DIV/0!"},{"$error":"#DIV/0!"},{"$error":"#DIV/0!"},{"$error":"#DIV/0!"},{"$error":"#DIV/0!"},{"$error":"#DIV/0!"},{"$f":"IF(A97=\"m\",VLOOKUP(P97,Berechnung_Male!$A$1:$D$42,AA97,TRUE),VLOOKUP(Eingabeblatt!P97,Berechnung_Female!$A$1:$D$42,AA97,TRUE))","v":{"$error":"#DIV/0!"}},{"$error":"#DIV/0!"},null,null,null,{"$error":"#DIV/0!"}]
[null,null,null,null,null,null,null,0,null,null,null,0,0,0,{"$error":"#DIV/0!"},{"$error":"#DIV/0!"},{"$error":"#DIV/0!"},{"$error":"#DIV/0!"},{"$error":"#DIV/0!"},{"$error":"#DIV/0!"},{"$error":"#DIV/0!"},{"$f":"IF(A98=\"m\",VLOOKUP(P98,Berechnung_Male!$A$1:$D$42,AA98,TRUE),VLOOKUP(Eingabeblatt!P98,Berechnung_Female!$A$1:$D$42,AA98,TRUE))","v":{"$error":"#DIV/0!"}},{"$error":"#DIV/0!"},null,null,null,{"$error":"#DIV/0!"}]
[null,null,null,null,null,null,null,0,null,null,null,0,0,0,{"$error":"#DIV/0!"},{"$error":"#DIV/0!"},{"$error":"#DIV/0!"},{"$error":"#DIV/0!"},{"$error":"#DIV/0!"},{"$error":"#DIV/0!"},{"$error":"#DIV/0!"},{"$f":"IF(A99=\"m\",VLOOKUP(P99,Berechnung_Male!$A$1:$D$42,AA99,TRUE),VLOOKUP(Eingabeblatt!P99,Berechnung_Female!$A$1:$D$42,AA99,TRUE))","v":{"$error":"#DIV/0!"}},{"$error":"#DIV/0!"},null,null,null,{"$error":"#DIV/0!"}]
[null,null,null,null,null,null,null,0,null,null,null,0,0,0,{"$error":"#DIV/0!"},{"$error":"#DIV/0!"},{"$error":"#DIV/0!"},{"$error":"#DIV/0!"},{"$error":"#DIV/0!"},{"$error":"#DIV/0!"},{"$error":"#DIV/0!"},{"$f":"IF(A100=\"m\",VLOOKUP(P100,Berechnung_Male!$A$1:$D$42,AA100,TRUE),VLOOKUP(Eingabeblatt!P100,Berechnung_Female!$A$1:$D$42,AA100,TRUE))","v":{"$error":"#DIV/0!"}},{"$error":"#DIV/0!"},null,null,null,{"$error":"#DIV/0!"}]
[null,null,null,null,null,null,null,0,null,null,null,0,0,0,{"$error":"#DIV/0!"},{"$error":"#DIV/0!"},{"$error":"#DIV/0!"},{"$error":"#DIV/0!"},{"$error":"#DIV/0!"},{"$error":"#DIV/0!"},{"$error":"#DIV/0!"},{"$f":"IF(A101=\"m\",VLOOKUP(P101,Berechnung_Male!$A$1:$D$42,AA101,TRUE),VLOOKUP(Eingabeblatt!P101,Berechnung_Female!$A$1:$D$42,AA101,TRUE))","v":{"$error":"#DIV/0!"}},{"$error":"#DIV/0!"},null,null,null,{"$error":"#DIV/0!"}]
[null,null,null,null,null,null,null,0,null,null,null,0,0,0,{"$error":"#DIV/0!"},{"$error":"#DIV/0!"},{"$error":"#DIV/0!"},{"$error":"#DIV/0!"},{"$error":"#DIV/0!"},{"$error":"#DIV/0!"},{"$error":"#DIV/0!"},{"$f":"IF(A102=\"m\",VLOOKUP(P102,Berechnung_Male!$A$1:$D$42,AA102,TRUE),VLOOKUP(Eingabeblatt!P102,Berechnung_Female!$A$1:$D$42,AA102,TRUE))","v":{"$error":"#DIV/0!"}},{"$error":"#DIV/0!"},null,null,null,{"$error":"#DIV/0!"}]
[null,null,null,null,null,null,null,0,null,null,null,0,0,0,{"$error":"#DIV/0!"},{"$error":"#DIV/0!"},{"$error":"#DIV/0!"},{"$error":"#DIV/0!"},{"$error":"#DIV/0!"},{"$error":"#DIV/0!"},{"$error":"#DIV/0!"},{"$f":"IF(A103=\"m\",VLOOKUP(P103,Berechnung_Male!$A$1:$D$42,AA103,TRUE),VLOOKUP(Eingabeblatt!P103,Berechnung_Female!$A$1:$D$42,AA103,TRUE))","v":{"$error":"#DIV/0!"}},{"$error":"#DIV/0!"},null,null,null,{"$error":"#DIV/0!"}]
[null,null,null,null,null,null,null,0,null,null,null,0,0,0,{"$error":"#DIV/0!"},{"$error":"#DIV/0!"},{"$error":"#DIV/0!"},{"$error":"#DIV/0!"},{"$error":"#DIV/0!"},{"$error":"#DIV/0!"},{"$error":"#DIV/0!"},{"$f":"IF(A104=\"m\",VLOOKUP(P104,Berechnung_Male!$A$1:$D$42,AA104,TRUE),VLOOKUP(Eingabeblatt!P104,Berechnung_Female!$A$1:$D$42,AA104,TRUE))","v":{"$error":"#DIV/0!"}},{"$error":"#DIV/0!"},null,null,null,{"$error":"#DIV/0!"}]
[null,null,null,null,null,null,null,0,null,null,null,0,0,0,{"$error":"#DIV/0!"},{"$error":"#DIV/0!"},{"$error":"#DIV/0!"},{"$error":"#DIV/0!"},{"$error":"#DIV/0!"},{"$error":"#DIV/0!"},{"$error":"#DIV/0!"},{"$f":"IF(A105=\"m\",VLOOKUP(P105,Berechnung_Male!$A$1:$D$42,AA105,TRUE),VLOOKUP(Eingabeblatt!P105,Berechnung_Female!$A$1:$D$42,AA105,TRUE))","v":{"$error":"#DIV/0!"}},{"$error":"#DIV/0!"},null,null,null,{"$error":"#DIV/0!"}]
[null,null,null,null,null,null,null,0,null,null,null,0,0,0,{"$error":"#DIV/0!"},{"$error":"#DIV/0!"},{"$error":"#DIV/0!"},{"$error":"#DIV/0!"},{"$error":"#DIV/0!"},{"$error":"#DIV/0!"},{"$error":"#DIV/0!"},{"$f":"IF(A106=\"m\",VLOOKUP(P106,Berechnung_Male!$A$1:$D$42,AA106,TRUE),VLOOKUP(Eingabeblatt!P106,Berechnung_Female!$A$1:$D$42,AA106,TRUE))","v":{"$error":"#DIV/0!"}},{"$error":"#DIV/0!"},null,null,null,{"$error":"#DIV/0!"}]
[null,null,null,null,null,null,null,0,null,null,null,0,0,0,{"$error":"#DIV/0!"},{"$error":"#DIV/0!"},{"$error":"#DIV/0!"},{"$error":"#DIV/0!"},{"$error":"#DIV/0!"},{"$error":"#DIV/0!"},{"$error":"#DIV/0!"},{"$f":"IF(A107=\"m\",VLOOKUP(P107,Berechnung_Male!$A$1:$D$42,AA107,TRUE),VLOOKUP(Eingabeblatt!P107,Berechnung_Female!$A$1:$D$42,AA107,TRUE))","v":{"$error":"#DIV/0!"}},{"$error":"#DIV/0!"},null,null,null,{"$error":"#DIV/0!"}]
[null,null,null,null,null,null,null,0,null,null,null,0,0,0,{"$error":"#DIV/0!"},{"$error":"#DIV/0!"},{"$error":"#DIV/0!"},{"$error":"#DIV/0!"},{"$error":"#DIV/0!"},{"$error":"#DIV/0!"},{"$error":"#DIV/0!"},{"$f":"IF(A108=\"m\",VLOOKUP(P108,Berechnung_Male!$A$1:$D$42,AA108,TRUE),VLOOKUP(Eingabeblatt!P108,Berechnung_Female!$A$1:$D$42,AA108,TRUE))","v":{"$error":"#DIV/0!"}},{"$error":"#DIV/0!"},null,null,null,{"$error":"#DIV/0!"}]
[null,null,null,null,null,null,null,0,null,null,null,0,0,0,{"$error":"#DIV/0!"},{"$error":"#DIV/0!"},{"$error":"#DIV/0!"},{"$error":"#DIV/0!"},{"$error":"#DIV/0!"},{"$error":"#DIV/0!"},{"$error":"#DIV/0!"},{"$f":"IF(A109=\"m\",VLOOKUP(P109,Berechnung_Male!$A$1:$D$42,AA109,TRUE),VLOOKUP(Eingabeblatt!P109,Berechnung_Female!$A$1:$D$42,AA109,TRUE))","v":{"$error":"#DIV/0!"}},{"$error":"#DIV/0!"},null,null,null,{"$error":"#DIV/0!"}]
[null,null,null,null,null,null,null,0,null,null,null,0,0,0,{"$error":"#DIV/0!"},{"$error":"#DIV/0!"},{"$error":"#DIV/0!"},{"$error":"#DIV/0!"},{"$error":"#DIV/0!"},{"$error":"#DIV/0!"},{"$error":"#DIV/0!"},{"$f":"IF(A110=\"m\",VLOOKUP(P110,Berechnung_Male!$A$1:$D$42,AA110,TRUE),VLOOKUP(Eingabeblatt!P110,Berechnung_Female!$A$1:$D$42,AA110,TRUE))","v":{"$error":"#DIV/0!"}},{"$error":"#DIV/0!"},null,null,null,{"$error":"#DIV/0!"}]
[null,null,null,null,null,null,null,0,null,null,null,0,0,0,{"$error":"#DIV/0!"},{"$error":"#DIV/0!"},{"$error":"#DIV/0!"},{"$error":"#DIV/0!"},{"$error":"#DIV/0!"},{"$error":"#DIV/0!"},{"$error":"#DIV/0!"},{"$f":"IF(A111=\"m\",VLOOKUP(P111,Berechnung_Male!$A$1:$D$42,AA111,TRUE),VLOOKUP(Eingabeblatt!P111,Berechnung_Female!$A$1:$D$42,AA111,TRUE))","v":{"$error":"#DIV/0!"}},{"$error":"#DIV/0!"},null,null,null,{"$error":"#DIV/0!"}]
[null,null,null,null,null,null,null,0,null,null,null,0,0,0,{"$error":"#DIV/0!"},{"$error":"#DIV/0!"},{"$error":"#DIV/0!"},{"$error":"#DIV/0!"},{"$error":"#DIV/0!"},{"$error":"#DIV/0!"},{"$error":"#DIV/0!"},{"$f":"IF(A112=\"m\",VLOOKUP(P112,Berechnung_Male!$A$1:$D$42,AA112,TRUE),VLOOKUP(Eingabeblatt!P112,Berechnung_Female!$A$1:$D$42,AA112,TRUE))","v":{"$error":"#DIV/0!"}},{"$error":"#DIV/0!"},null,null,null,{"$error":"#DIV/0!"}]
[null,null,null,null,null,null,null,0,null,null,null,0,0,0,{"$error":"#DIV/0!"},{"$error":"#DIV/0!"},{"$error":"#DIV/0!"},{"$error":"#DIV/0!"},{"$error":"#DIV/0!"},{"$error":"#DIV/0!"},{"$error":"#DIV/0!"},{"$f":"IF(A113=\"m\",VLOOKUP(P113,Berechnung_Male!$A$1:$D$42,AA113,TRUE),VLOOKUP(Eingabeblatt!P113,Berechnung_Female!$A$1:$D$42,AA113,TRUE))","v":{"$error":"#DIV/0!"}},{"$error":"#DIV/0!"},null,null,null,{"$error":"#DIV/0!"}]
[null,null,null,null,null,null,null,0,null,null,null,0,0,0,{"$error":"#DIV/0!"},{"$error":"#DIV/0!"},{"$error":"#DIV/0!"},{"$error":"#DIV/0!"},{"$error":"#DIV/0!"},{"$error":"#DIV/0!"},{"$error":"#DIV/0!"},{"$f":"IF(A114=\"m\",VLOOKUP(P114,Berechnung_Male!$A$1:$D$42,AA114,TRUE),VLOOKUP(Eingabeblatt!P114,Berechnung_Female!$A$1:$D$42,AA114,TRUE))","v":{"$error":"#DIV/0!"}},{"$error":"#DIV/0!"},null,null,null,{"$error":"#DIV/0!"}]
[null,null,null,null,null,null,null,0,null,null,null,0,0,0,{"$error":"#DIV/0!"},{"$error":"#DIV/0!"},{"$error":"#DIV/0!"},{"$error":"#DIV/0!"},{"$error":"#DIV/0!"},{"$error":"#DIV/0!"},{"$error":"#DIV/0!"},{"$f":"IF(A115=\"m\",VLOOKUP(P115,Berechnung_Male!$A$1:$D$42,AA115,TRUE),VLOOKUP(Eingabeblatt!P115,Berechnung_Female!$A$1:$D$42,AA115,TRUE))","v":{"$error":"#DIV/0!"}},{"$error":"#DIV/0!"},null,null,null,{"$error":"#DIV/0!"}]
[null,null,null,null,null,null,null,0,null,null,null,0,0,0,{"$error":"#DIV/0!"},{"$error":"#DIV/0!"},{"$error":"#DIV/0!"},{"$error":"#DIV/0!"},{"$error":"#DIV/0!"},{"$error":"#DIV/0!"},{"$error":"#DIV/0!"},{"$f":"IF(A116=\"m\",VLOOKUP(P116,Berechnung_Male!$A$1:$D$42,AA116,TRUE),VLOOKUP(Eingabeblatt!P116,Berechnung_Female!$A$1:$D$42,AA116,TRUE))","v":{"$error":"#DIV/0!"}},{"$error":"#DIV/0!"},null,null,null,{"$error":"#DIV/0!"}]
[null,null,null,null,null,null,null,0,null,null,null,0,0,0,{"$error":"#DIV/0!"},{"$error":"#DIV/0!"},{"$error":"#DIV/0!"},{"$error":"#DIV/0!"},{"$error":"#DIV/0!"},{"$error":"#DIV/0!"},{"$error":"#DIV/0!"},{"$f":"IF(A117=\"m\",VLOOKUP(P117,Berechnung_Male!$A$1:$D$42,AA117,TRUE),VLOOKUP(Eingabeblatt!P117,Berechnung_Female!$A$1:$D$42,AA117,TRUE))","v":{"$error":"#DIV/0!"}},{"$error":"#DIV/0!"},null,null,null,{"$error":"#DIV/0!"}]
[null,null,null,null,null,null,null,0,null,null,null,0,0,0,{"$error":"#DIV/0!"},{"$error":"#DIV/0!"},{"$error":"#DIV/0!"},{"$error":"#DIV/0!"},{"$error":"#DIV/0!"},{"$error":"#DIV/0!"},{"$error":"#DIV/0!"},{"$f":"IF(A118=\"m\",VLOOKUP(P118,Berechnung_Male!$A$1:$D$42,AA118,TRUE),VLOOKUP(Eingabeblatt!P118,Berechnung_Female!$A$1:$D$42,AA118,TRUE))","v":{"$error":"#DIV/0!"}},{"$error":"#DIV/0!"},null,null,null,{"$error":"#DIV/0!"}]
[null,null,null,null,null,null,null,0,null,null,null,0,0,0,{"$error":"#DIV/0!"},{"$error":"#DIV/0!"},{"$error":"#DIV/0!"},{"$error":"#DIV/0!"},{"$error":"#DIV/0!"},{"$error":"#DIV/0!"},{"$error":"#DIV/0!"},{"$f":"IF(A119=\"m\",VLOOKUP(P119,Berechnung_Male!$A$1:$D$42,AA119,TRUE),VLOOKUP(Eingabeblatt!P119,Berechnung_Female!$A$1:$D$42,AA119,TRUE))","v":{"$error":"#DIV/0!"}},{"$error":"#DIV/0!"},null,null,null,{"$error":"#DIV/0!"}]
[null,null,null,null,null,null,null,0,null,null,null,0,0,0,{"$error":"#DIV/0!"},{"$error":"#DIV/0!"},{"$error":"#DIV/0!"},{"$error":"#DIV/0!"},{"$error":"#DIV/0!"},{"$error":"#DIV/0!"},{"$error":"#DIV/0!"},{"$f":"IF(A120=\"m\",VLOOKUP(P120,Berechnung_Male!$A$1:$D$42,AA120,TRUE),VLOOKUP(Eingabeblatt!P120,Berechnung_Female!$A$1:$D$42,AA120,TRUE))","v":{"$error":"#DIV/0!"}},{"$error":"#DIV/0!"},null,null,null,{"$error":"#DIV/0!"}]
[null,null,null,null,null,null,null,0,null,null,null,0,0,0,{"$error":"#DIV/0!"},{"$error":"#DIV/0!"},{"$error":"#DIV/0!"},{"$error":"#DIV/0!"},{"$error":"#DIV/0!"},{"$error":"#DIV/0!"},{"$error":"#DIV/0!"},{"$f":"IF(A121=\"m\",VLOOKUP(P121,Berechnung_Male!$A$1:$D$42,AA121,TRUE),VLOOKUP(Eingabeblatt!P121,Berechnung_Female!$A$1:$D$42,AA121,TRUE))","v":{"$error":"#DIV/0!"}},{"$error":"#DIV/0!"},null,null,null,{"$error":"#DIV/0!"}]
[null,null,null,null,null,null,null,0,null,null,null,0,0,0,{"$error":"#DIV/0!"},{"$error":"#DIV/0!"},{"$error":"#DIV/0!"},{"$error":"#DIV/0!"},{"$error":"#DIV/0!"},{"$error":"#DIV/0!"},{"$error":"#DIV/0!"},{"$f":"IF(A122=\"m\",VLOOKUP(P122,Berechnung_Male!$A$1:$D$42,AA122,TRUE),VLOOKUP(Eingabeblatt!P122,Berechnung_Female!$A$1:$D$42,AA122,TRUE))","v":{"$error":"#DIV/0!"}},{"$error":"#DIV/0!"},null,null,null,{"$error":"#DIV/0!"}]
[null,null,null,null,null,null,null,0,null,null,null,0,0,0,{"$error":"#DIV/0!"},{"$error":"#DIV/0!"},{"$error":"#DIV/0!"},{"$error":"#DIV/0!"},{"$error":"#DIV/0!"},{"$error":"#DIV/0!"},{"$error":"#DIV/0!"},{"$f":"IF(A123=\"m\",VLOOKUP(P123,Berechnung_Male!$A$1:$D$42,AA123,TRUE),VLOOKUP(Eingabeblatt!P123,Berechnung_Female!$A$1:$D$42,AA123,TRUE))","v":{"$error":"#DIV/0!"}},{"$error":"#DIV/0!"},null,null,null,{"$error":"#DIV/0!"}]
[null,null,null,null,null,null,null,0,null,null,null,0,0,0,{"$error":"#DIV/0!"},{"$error":"#DIV/0!"},{"$error":"#DIV/0!"},{"$error":"#DIV/0!"},{"$error":"#DIV/0!"},{"$error":"#DIV/0!"},{"$error":"#DIV/0!"},{"$f":"IF(A124=\"m\",VLOOKUP(P124,Berechnung_Male!$A$1:$D$42,AA124,TRUE),VLOOKUP(Eingabeblatt!P124,Berechnung_Female!$A$1:$D$42,AA124,TRUE))","v":{"$error":"#DIV/0!"}},{"$error":"#DIV/0!"},null,null,null,{"$error":"#DIV/0!"}]
[null,null,null,null,null,null,null,0,null,null,null,0,0,0,{"$error":"#DIV/0!"},{"$error":"#DIV/0!"},{"$error":"#DIV/0!"},{"$error":"#DIV/0!"},{"$error":"#DIV/0!"},{"$error":"#DIV/0!"},{"$error":"#DIV/0!"},{"$f":"IF(A125=\"m\",VLOOKUP(P125,Berechnung_Male!$A$1:$D$42,AA125,TRUE),VLOOKUP(Eingabeblatt!P125,Berechnung_Female!$A$1:$D$42,AA125,TRUE))","v":{"$error":"#DIV/0!"}},{"$error":"#DIV/0!"},null,null,null,{"$error":"#DIV/0!"}]
[null,null,null,null,null,null,null,0,null,null,null,0,0,0,{"$error":"#DIV/0!"},{"$error":"#DIV/0!"},{"$error":"#DIV/0!"},{"$error":"#DIV/0!"},{"$error":"#DIV/0!"},{"$error":"#DIV/0!"},{"$error":"#DIV/0!"},{"$f":"IF(A126=\"m\",VLOOKUP(P126,Berechnung_Male!$A$1:$D$42,AA126,TRUE),VLOOKUP(Eingabeblatt!P126,Berechnung_Female!$A$1:$D$42,AA126,TRUE))","v":{"$error":"#DIV/0!"}},{"$error":"#DIV/0!"},null,null,null,{"$error":"#DIV/0!"}]
[null,null,null,null,null,null,null,0,null,null,null,0,0,0,{"$error":"#DIV/0!"},{"$error":"#DIV/0!"},{"$error":"#DIV/0!"},{"$error":"#DIV/0!"},{"$error":"#DIV/0!"},{"$error":"#DIV/0!"},{"$error":"#DIV/0!"},{"$f":"IF(A127=\"m\",VLOOKUP(P127,Berechnung_Male!$A$1:$D$42,AA127,TRUE),VLOOKUP(Eingabeblatt!P127,Berechnung_Female!$A$1:$D$42,AA127,TRUE))","v":{"$error":"#DIV/0!"}},{"$error":"#DIV/0!"},null,null,null,{"$error":"#DIV/0!"}]
[null,null,null,null,null,null,null,0,null,null,null,0,0,0,{"$error":"#DIV/0!"},{"$error":"#DIV/0!"},{"$error":"#DIV/0!"},{"$error":"#DIV/0!"},{"$error":"#DIV/0!"},{"$error":"#DIV/0!"},{"$error":"#DIV/0!"},{"$f":"IF(A128=\"m\",VLOOKUP(P128,Berechnung_Male!$A$1:$D$42,AA128,TRUE),VLOOKUP(Eingabeblatt!P128,Berechnung_Female!$A$1:$D$42,AA128,TRUE))","v":{"$error":"#DIV/0!"}},{"$error":"#DIV/0!"},null,null,null,{"$error":"#DIV/0!"}]
[null,null,null,null,null,null,null,0,null,null,null,0,0,0,{"$error":"#DIV/0!"},{"$error":"#DIV/0!"},{"$error":"#DIV/0!"},{"$error":"#DIV/0!"},{"$error":"#DIV/0!"},{"$error":"#DIV/0!"},{"$error":"#DIV/0!"},{"$f":"IF(A129=\"m\",VLOOKUP(P129,Berechnung_Male!$A$1:$D$42,AA129,TRUE),VLOOKUP(Eingabeblatt!P129,Berechnung_Female!$A$1:$D$42,AA129,TRUE))","v":{"$error":"#DIV/0!"}},{"$error":"#DIV/0!"},null,null,null,{"$error":"#DIV/0!"}]
[null,null,null,null,null,null,null,0,null,null,null,0,0,0,{"$error":"#DIV/0!"},{"$error":"#DIV/0!"},{"$error":"#DIV/0!"},{"$error":"#DIV/0!"},{"$error":"#DIV/0!"},{"$error":"#DIV/0!"},{"$error":"#DIV/0!"},{"$f":"IF(A130=\"m\",VLOOKUP(P130,Berechnung_Male!$A$1:$D$42,AA130,TRUE),VLOOKUP(Eingabeblatt!P130,Berechnung_Female!$A$1:$D$42,AA130,TRUE))","v":{"$error":"#DIV/0!"}},{"$error":"#DIV/0!"},null,null,null,{"$error":"#DIV/0!"}]
[null,null,null,null,null,null,null,0,null,null,null,0,0,0,{"$error":"#DIV/0!"},{"$error":"#DIV/0!"},{"$error":"#DIV/0!"},{"$error":"#DIV/0!"},{"$error":"#DIV/0!"},{"$error":"#DIV/0!"},{"$error":"#DIV/0!"},{"$f":"IF(A131=\"m\",VLOOKUP(P131,Berechnung_Male!$A$1:$D$42,AA131,TRUE),VLOOKUP(Eingabeblatt!P131,Berechnung_Female!$A$1:$D$42,AA131,TRUE))","v":{"$error":"#DIV/0!"}},{"$error":"#DIV/0!"},null,null,null,{"$error":"#DIV/0!"}]
[null,null,null,null,null,null,null,0,null,null,null,0,0,0,{"$error":"#DIV/0!"},{"$error":"#DIV/0!"},{"$error":"#DIV/0!"},{"$error":"#DIV/0!"},{"$error":"#DIV/0!"},{"$error":"#DIV/0!"},{"$error":"#DIV/0!"},{"$f":"IF(A132=\"m\",VLOOKUP(P132,Berechnung_Male!$A$1:$D$42,AA132,TRUE),VLOOKUP(Eingabeblatt!P132,Berechnung_Female!$A$1:$D$42,AA132,TRUE))","v":{"$error":"#DIV/0!"}},{"$error":"#DIV/0!"},null,null,null,{"$error":"#DIV/0!"}]
[null,null,null,null,null,null,null,0,null,null,null,0,0,0,{"$error":"#DIV/0!"},{"$error":"#DIV/0!"},{"$error":"#DIV/0!"},{"$error":"#DIV/0!"},{"$f":"IF(A133=\"m\",(IF(O133<12.8,1,IF(O133<13.3,2,IF(O133>14.8,5,IF(O133>14.3,4,3))))),(IF(O133<11,1,IF(O133<11.5,2,IF(O133>13,5,IF(O133>12.5,4,3))))))","v":{"$error":"#DIV/0!"}},{"$error":"#DIV/0!"},{"$error":"#DIV/0!"},{"$f":"IF(A133=\"m\",VLOOKUP(P133,Berechnung_Male!$A$1:$D$42,AA133,TRUE),VLOOKUP(Eingabeblatt!P133,Berechnung_Female!$A$1:$D$42,AA133,TRUE))","v":{"$error":"#DIV/0!"}},{"$error":"#DIV/0!"},null,null,null,{"$f":"IF(A133=\"m\",IF(O133<12.8,2,IF(O133<14.8,3,4)),IF(O133<11,2,IF(O133<13,3,4)))","v":{"$error":"#DIV/0!"}}]
[null,null,null,null,null,null,null,{"$f":"F134-G134","v":0},null,null,null,{"$f":"J134-K134","v":0},{"$f":"I134-L134","v":0},{"$f":"(B134-E134)/365.25","v":0},{"$f":"N134-P134","v":{"$error":"#DIV/0!"}},{"$f":"IF(A134=\"m\",(-9.236+(0.0002708*M134*L134)+(-0.001663*N134*M134)+(0.007216*N134*L134)+(0.02292*H134/I134*100)),(-9.376+(0.0001882*M134*L134)+(0.0022*N134*M134)+(0.005841*N134*L134)-(0.002658*N134*H134)+(0.07693*(H134/I134)*100)))","v":{"$error":"#DIV/0!"}},{"$f":"IF(R134=1,\"Früh / précoce\",IF(R134=2,\"Durchschnittlich / Normal\",\"Spät / Tardif\"))","v":{"$error":"#DIV/0!"}},{"$f":"IF(A134=\"m\",(IF(O134<12.8,1,IF(O134>14.8,3,2))),(IF(O134<11,1,IF(O134>13,3,2))))","v":{"$error":"#DIV/0!"}},{"$error":"#DIV/0!"},{"$f":"IF(S134=1,\"Früh / précoce\",IF(S134=2,\"Möglicherweise Früh / éventuellement précoce\", IF(S134=3,\"Durchschnittlich / Normal\",IF(S134=4,\"Möglicherweise spät / éventuellement tardif\",\"Spät / Tardif\"))))","v":{"$error":"#DIV/0!"}},{"$f":"I134+V134","v":{"$error":"#DIV/0!"}},{"$f":"IF(A134=\"m\",VLOOKUP(P134,Berechnung_Male!$A$1:$D$42,AA134,TRUE),VLOOKUP(Eingabeblatt!P134,Berechnung_Female!$A$1:$D$42,AA134,TRUE))","v":{"$error":"#DIV/0!"}},{"$f":"I134/U134","v":{"$error":"#DIV/0!"}},null,null,null,{"$error":"#DIV/0!"}]
[null,null,null,null,null,null,null,0,null,null,null,0,0,0,{"$error":"#DIV/0!"},{"$error":"#DIV/0!"},{"$error":"#DIV/0!"},{"$error":"#DIV/0!"},{"$error":"#DIV/0!"},{"$error":"#DIV/0!"},{"$error":"#DIV/0!"},{"$f":"IF(A135=\"m\",VLOOKUP(P135,Berechnung_Male!$A$1:$D$42,AA135,TRUE),VLOOKUP(Eingabeblatt!P135,Berechnung_Female!$A$1:$D$42,AA135,TRUE))","v":{"$error":"#DIV/0!"}},{"$error":"#DIV/0!"},null,null,null,{"$error":"#DIV/0!"}]
[null,null,null,null,null,null,null,0,null,null,null,0,0,0,{"$error":"#DIV/0!"},{"$error":"#DIV/0!"},{"$error":"#DIV/0!"},{"$error":"#DIV/0!"},{"$error":"#DIV/0!"},{"$error":"#DIV/0!"},{"$error":"#DIV/0!"},{"$f":"IF(A136=\"m\",VLOOKUP(P136,Berechnung_Male!$A$1:$D$42,AA136,TRUE),VLOOKUP(Eingabeblatt!P136,Berechnung_Female!$A$1:$D$42,AA136,TRUE))","v":{"$error":"#DIV/0!"}},{"$error":"#DIV/0!"},null,null,null,{"$error":"#DIV/0!"}]
[null,null,null,null,null,null,null,0,null,null,null,0,0,0,{"$error":"#DIV/0!"},{"$error":"#DIV/0!"},{"$error":"#DIV/0!"},{"$error":"#DIV/0!"},{"$error":"#DIV/0!"},{"$error":"#DIV/0!"},{"$error":"#DIV/0!"},{"$f":"IF(A137=\"m\",VLOOKUP(P137,Berechnung_Male!$A$1:$D$42,AA137,TRUE),VLOOKUP(Eingabeblatt!P137,Berechnung_Female!$A$1:$D$42,AA137,TRUE))","v":{"$error":"#DIV/0!"}},{"$error":"#DIV/0!"},null,null,null,{"$error":"#DIV/0!"}]
[null,null,null,null,null,null,null,0,null,null,null,0,0,0,{"$error":"#DIV/0!"},{"$error":"#DIV/0!"},{"$error":"#DIV/0!"},{"$error":"#DIV/0!"},{"$error":"#DIV/0!"},{"$error":"#DIV/0!"},{"$error":"#DIV/0!"},{"$f":"IF(A138=\"m\",VLOOKUP(P138,Berechnung_Male!$A$1:$D$42,AA138,TRUE),VLOOKUP(Eingabeblatt!P138,Berechnung_Female!$A$1:$D$42,AA138,TRUE))","v":{"$error":"#DIV/0!"}},{"$error":"#DIV/0!"},null,null,null,{"$error":"#DIV/0!"}]
[null,null,null,null,null,null,null,0,null,null,null,0,0,0,{"$error":"#DIV/0!"},{"$error":"#DIV/0!"},{"$error":"#DIV/0!"},{"$error":"#DIV/0!"},{"$error":"#DIV/0!"},{"$error":"#DIV/0!"},{"$error":"#DIV/0!"},{"$f":"IF(A139=\"m\",VLOOKUP(P139,Berechnung_Male!$A$1:$D$42,AA139,TRUE),VLOOKUP(Eingabeblatt!P139,Berechnung_Female!$A$1:$D$42,AA139,TRUE))","v":{"$error":"#DIV/0!"}},{"$error":"#DIV/0!"},null,null,null,{"$error":"#DIV/0!"}]
[null,null,null,null,null,null,null,0,null,null,null,0,0,0,{"$error":"#DIV/0!"},{"$error":"#DIV/0!"},{"$error":"#DIV/0!"},{"$error":"#DIV/0!"},{"$error":"#DIV/0!"},{"$error":"#DIV/0!"},{"$error":"#DIV/0!"},{"$f":"IF(A140=\"m\",VLOOKUP(P140,Berechnung_Male!$A$1:$D$42,AA140,TRUE),VLOOKUP(Eingabeblatt!P140,Berechnung_Female!$A$1:$D$42,AA140,TRUE))","v":{"$error":"#DIV/0!"}},{"$error":"#DIV/0!"},null,null,null,{"$error":"#DIV/0!"}]
[null,null,null,null,null,null,null,0,null,null,null,0,0,0,{"$error":"#DIV/0!"},{"$error":"#DIV/0!"},{"$error":"#DIV/0!"},{"$error":"#DIV/0!"},{"$error":"#DIV/0!"},{"$error":"#DIV/0!"},{"$error":"#DIV/0!"},{"$f":"IF(A141=\"m\",VLOOKUP(P141,Berechnung_Male!$A$1:$D$42,AA141,TRUE),VLOOKUP(Eingabeblatt!P141,Berechnung_Female!$A$1:$D$42,AA141,TRUE))","v":{"$error":"#DIV/0!"}},{"$error":"#DIV/0!"},null,null,null,{"$error":"#DIV/0!"}]
[null,null,null,null,null,null,null,0,null,null,null,0,0,0,{"$error":"#DIV/0!"},{"$error":"#DIV/0!"},{"$error":"#DIV/0!"},{"$error":"#DIV/0!"},{"$error":"#DIV/0!"},{"$error":"#DIV/0!"},{"$error":"#DIV/0!"},{"$f":"IF(A142=\"m\",VLOOKUP(P142,Berechnung_Male!$A$1:$D$42,AA142,TRUE),VLOOKUP(Eingabeblatt!P142,Berechnung_Female!$A$1:$D$42,AA142,TRUE))","v":{"$error":"#DIV/0!"}},{"$error":"#DIV/0!"},null,null,null,{"$error":"#DIV/0!"}]
[null,null,null,null,null,null,null,0,null,null,null,0,0,0,{"$error":"#DIV/0!"},{"$error":"#DIV/0!"},{"$error":"#DIV/0!"},{"$error":"#DIV/0!"},{"$error":"#DIV/0!"},{"$error":"#DIV/0!"},{"$error":"#DIV/0!"},{"$f":"IF(A143=\"m\",VLOOKUP(P143,Berechnung_Male!$A$1:$D$42,AA143,TRUE),VLOOKUP(Eingabeblatt!P143,Berechnung_Female!$A$1:$D$42,AA143,TRUE))","v":{"$error":"#DIV/0!"}},{"$error":"#DIV/0!"},null,null,null,{"$error":"#DIV/0!"}]
[null,null,null,null,null,null,null,0,null,null,null,0,0,0,{"$error":"#DIV/0!"},{"$error":"#DIV/0!"},{"$error":"#DIV/0!"},{"$error":"#DIV/0!"},{"$error":"#DIV/0!"},{"$error":"#DIV/0!"},{"$error":"#DIV/0!"},{"$f":"IF(A144=\"m\",VLOOKUP(P144,Berechnung_Male!$A$1:$D$42,AA144,TRUE),VLOOKUP(Eingabeblatt!P144,Berechnung_Female!$A$1:$D$42,AA144,TRUE))","v":{"$error":"#DIV/0!"}},{"$error":"#DIV/0!"},null,null,null,{"$error":"#DIV/0!"}]
[null,null,null,null,null,null,null,0,null,null,null,0,0,0,{"$error":"#DIV/0!"},{"$error":"#DIV/0!"},{"$error":"#DIV/0!"},{"$error":"#DIV/0!"},{"$error":"#DIV/0!"},{"$error":"#DIV/0!"},{"$error":"#DIV/0!"},{"$f":"IF(A145=\"m\",VLOOKUP(P145,Berechnung_Male!$A$1:$D$42,AA145,TRUE),VLOOKUP(Eingabeblatt!P145,Berechnung_Female!$A$1:$D$42,AA145,TRUE))","v":{"$error":"#DIV/0!"}},{"$error":"#DIV/0!"},null,null,null,{"$error":"#DIV/0!"}]
[null,null,null,null,null,null,null,0,null,null,null,0,0,0,{"$error":"#DIV/0!"},{"$error":"#DIV/0!"},{"$error":"#DIV/0!"},{"$error":"#DIV/0!"},{"$error":"#DIV/0!"},{"$error":"#DIV/0!"},{"$error":"#DIV/0!"},{"$f":"IF(A146=\"m\",VLOOKUP(P146,Berechnung_Male!$A$1:$D$42,AA146,TRUE),VLOOKUP(Eingabeblatt!P146,Berechnung_Female!$A$1:$D$42,AA146,TRUE))","v":{"$error":"#DIV/0!"}},{"$error":"#DIV/0!"},null,null,null,{"$error":"#DIV/0!"}]
[null,null,null,null,null,null,null,0,null,null,null,0,0,0,{"$error":"#DIV/0!"},{"$error":"#DIV/0!"},{"$error":"#DIV/0!"},{"$error":"#DIV/0!"},{"$error":"#DIV/0!"},{"$error":"#DIV/0!"},{"$error":"#DIV/0!"},{"$f":"IF(A147=\"m\",VLOOKUP(P147,Berechnung_Male!$A$1:$D$42,AA147,TRUE),VLOOKUP(Eingabeblatt!P147,Berechnung_Female!$A$1:$D$42,AA147,TRUE))","v":{"$error":"#DIV/0!"}},{"$error":"#DIV/0!"},null,null,null,{"$error":"#DIV/0!"}]
[null,null,null,null,null,null,null,0,null,null,null,0,0,0,{"$error":"#DIV/0!"},{"$error":"#DIV/0!"},{"$error":"#DIV/0!"},{"$error":"#DIV/0!"},{"$error":"#DIV/0!"},{"$error":"#DIV/0!"},{"$error":"#DIV/0!"},{"$f":"IF(A148=\"m\",VLOOKUP(P148,Berechnung_Male!$A$1:$D$42,AA148,TRUE),VLOOKUP(Eingabeblatt!P148,Berechnung_Female!$A$1:$D$42,AA148,TRUE))","v":{"$error":"#DIV/0!"}},{"$error":"#DIV/0!"},null,null,null,{"$error":"#DIV/0!"}]
[null,null,null,null,null,null,null,0,null,null,null,0,0,0,{"$error":"#DIV/0!"},{"$error":"#DIV/0!"},{"$error":"#DIV/0!"},{"$error":"#DIV/0!"},{"$error":"#DIV/0!"},{"$error":"#DIV/0!"},{"$error":"#DIV/0!"},{"$f":"IF(A149=\"m\",VLOOKUP(P149,Berechnung_Male!$A$1:$D$42,AA149,TRUE),VLOOKUP(Eingabeblatt!P149,Berechnung_Female!$A$1:$D$42,AA149,TRUE))","v":{"$error":"#DIV/0!"}},{"$error":"#DIV/0!"},null,null,null,{"$error":"#DIV/0!"}]
[null,null,null,null,null,null,null,0,null,null,null,0,0,0,{"$error":"#DIV/0!"},{"$error":"#DIV/0!"},{"$error":"#DIV/0!"},{"$error":"#DIV/0!"},{"$error":"#DIV/0!"},{"$error":"#DIV/0!"},{"$error":"#DIV/0!"},{"$f":"IF(A150=\"m\",VLOOKUP(P150,Berechnung_Male!$A$1:$D$42,AA150,TRUE),VLOOKUP(Eingabeblatt!P150,Berechnung_Female!$A$1:$D$42,AA150,TRUE))","v":{"$error":"#DIV/0!"}},{"$error":"#DIV/0!"},null,null,null,{"$error":"#DIV/0!"}]
[null,null,null,null,null,null,null,0,null,null,null,0,0,0,{"$error":"#DIV/0!"},{"$error":"#DIV/0!"},{"$error":"#DIV/0!"},{"$error":"#DIV/0!"},{"$error":"#DIV/0!"},{"$error":"#DIV/0!"},{"$error":"#DIV/0!"},{"$f":"IF(A151=\"m\",VLOOKUP(P151,Berechnung_Male!$A$1:$D$42,AA151,TRUE),VLOOKUP(Eingabeblatt!P151,Berechnung_Female!$A$1:$D$42,AA151,TRUE))","v":{"$error":"#DIV/0!"}},{"$error":"#DIV/0!"},null,null,null,{"$error":"#DIV/0!"}]
[null,null,null,null,null,null,null,0,null,null,null,0,0,0,{"$error":"#DIV/0!"},{"$error":"#DIV/0!"},{"$error":"#DIV/0!"},{"$error":"#DIV/0!"},{"$error":"#DIV/0!"},{"$error":"#DIV/0!"},{"$error":"#DIV/0!"},{"$f":"IF(A152=\"m\",VLOOKUP(P152,Berechnung_Male!$A$1:$D$42,AA152,TRUE),VLOOKUP(Eingabeblatt!P152,Berechnung_Female!$A$1:$D$42,AA152,TRUE))","v":{"$error":"#DIV/0!"}},{"$error":"#DIV/0!"},null,null,null,{"$error":"#DIV/0!"}]
[null,null,null,null,null,null,null,0,null,null,null,0,0,0,{"$error":"#DIV/0!"},{"$error":"#DIV/0!"},{"$error":"#DIV/0!"},{"$error":"#DIV/0!"},{"$error":"#DIV/0!"},{"$error":"#DIV/0!"},{"$error":"#DIV/0!"},{"$f":"IF(A153=\"m\",VLOOKUP(P153,Berechnung_Male!$A$1:$D$42,AA153,TRUE),VLOOKUP(Eingabeblatt!P153,Berechnung_Female!$A$1:$D$42,AA153,TRUE))","v":{"$error":"#DIV/0!"}},{"$error":"#DIV/0!"},null,null,null,{"$error":"#DIV/0!"}]
[null,null,null,null,null,null,null,0,null,null,null,0,0,0,{"$error":"#DIV/0!"},{"$error":"#DIV/0!"},{"$error":"#DIV/0!"},{"$error":"#DIV/0!"},{"$error":"#DIV/0!"},{"$error":"#DIV/0!"},{"$error":"#DIV/0!"},{"$f":"IF(A154=\"m\",VLOOKUP(P154,Berechnung_Male!$A$1:$D$42,AA154,TRUE),VLOOKUP(Eingabeblatt!P154,Berechnung_Female!$A$1:$D$42,AA154,TRUE))","v":{"$error":"#DIV/0!"}},{"$error":"#DIV/0!"},null,null,null,{"$error":"#DIV/0!"}]
[null,null,null,null,null,null,null,0,null,null,null,0,0,0,{"$error":"#DIV/0!"},{"$error":"#DIV/0!"},{"$error":"#DIV/0!"},{"$error":"#DIV/0!"},{"$error":"#DIV/0!"},{"$error":"#DIV/0!"},{"$error":"#DIV/0!"},{"$f":"IF(A155=\"m\",VLOOKUP(P155,Berechnung_Male!$A$1:$D$42,AA155,TRUE),VLOOKUP(Eingabeblatt!P155,Berechnung_Female!$A$1:$D$42,AA155,TRUE))","v":{"$error":"#DIV/0!"}},{"$error":"#DIV/0!"},null,null,null,{"$error":"#DIV/0!"}]
[null,null,null,null,null,null,null,0,null,null,null,0,0,0,{"$error":"#DIV/0!"},{"$error":"#DIV/0!"},{"$error":"#DIV/0!"},{"$error":"#DIV/0!"},{"$error":"#DIV/0!"},{"$error":"#DIV/0!"},{"$error":"#DIV/0!"},{"$f":"IF(A156=\"m\",VLOOKUP(P156,Berechnung_Male!$A$1:$D$42,AA156,TRUE),VLOOKUP(Eingabeblatt!P156,Berechnung_Female!$A$1:$D$42,AA156,TRUE))","v":{"$error":"#DIV/0!"}},{"$error":"#DIV/0!"},null,null,null,{"$error":"#DIV/0!"}]
[null,null,null,null,null,null,null,0,null,null,null,0,0,0,{"$error":"#DIV/0!"},{"$error":"#DIV/0!"},{"$error":"#DIV/0!"},{"$error":"#DIV/0!"},{"$error":"#DIV/0!"},{"$error":"#DIV/0!"},{"$error":"#DIV/0!"},{"$f":"IF(A157=\"m\",VLOOKUP(P157,Berechnung_Male!$A$1:$D$42,AA157,TRUE),VLOOKUP(Eingabeblatt!P157,Berechnung_Female!$A$1:$D$42,AA157,TRUE))","v":{"$error":"#DIV/0!"}},{"$error":"#DIV/0!"},null,null,null,{"$error":"#DIV/0!"}]
[null,null,null,null,null,null,null,0,null,null,null,0,0,0,{"$error":"#DIV/0!"},{"$error":"#DIV/0!"},{"$error":"#DIV/0!"},{"$error":"#DIV/0!"},{"$error":"#DIV/0!"},{"$error":"#DIV/0!"},{"$error":"#DIV/0!"},{"$f":"IF(A158=\"m\",VLOOKUP(P158,Berechnung_Male!$A$1:$D$42,AA158,TRUE),VLOOKUP(Eingabeblatt!P158,Berechnung_Female!$A$1:$D$42,AA158,TRUE))","v":{"$error":"#DIV/0!"}},{"$error":"#DIV/0!"},null,null,null,{"$error":"#DIV/0!"}]
[null,null,null,null,null,null,null,0,null,null,null,0,0,0,{"$error":"#DIV/0!"},{"$error":"#DIV/0!"},{"$error":"#DIV/0!"},{"$error":"#DIV/0!"},{"$error":"#DIV/0!"},{"$error":"#DIV/0!"},{"$error":"#DIV/0!"},{"$f":"IF(A159=\"m\",VLOOKUP(P159,Berechnung_Male!$A$1:$D$42,AA159,TRUE),VLOOKUP(Eingabeblatt!P159,Berechnung_Female!$A$1:$D$42,AA159,TRUE))","v":{"$error":"#DIV/0!"}},{"$error":"#DIV/0!"},null,null,null,{"$error":"#DIV/0!"}]
[null,null,null,null,null,null,null,0,null,null,null,0,0,0,{"$error":"#DIV/0!"},{"$error":"#DIV/0!"},{"$error":"#DIV/0!"},{"$error":"#DIV/0!"},{"$error":"#DIV/0!"},{"$error":"#DIV/0!"},{"$error":"#DIV/0!"},{"$f":"IF(A160=\"m\",VLOOKUP(P160,Berechnung_Male!$A$1:$D$42,AA160,TRUE),VLOOKUP(Eingabeblatt!P160,Berechnung_Female!$A$1:$D$42,AA160,TRUE))","v":{"$error":"#DIV/0!"}},{"$error":"#DIV/0!"},null,null,null,{"$error":"#DIV/0!"}]
[null,null,null,null,null,null,null,0,null,null,null,0,0,0,{"$error":"#DIV/0!"},{"$error":"#DIV/0!"},{"$error":"#DIV/0!"},{"$error":"#DIV/0!"},{"$error":"#DIV/0!"},{"$error":"#DIV/0!"},{"$error":"#DIV/0!"},{"$f":"IF(A161=\"m\",VLOOKUP(P161,Berechnung_Male!$A$1:$D$42,AA161,TRUE),VLOOKUP(Eingabeblatt!P161,Berechnung_Female!$A$1:$D$42,AA161,TRUE))","v":{"$error":"#DIV/0!"}},{"$error":"#DIV/0!"},null,null,null,{"$error":"#DIV/0!"}]
[null,null,null,null,null,null,null,0,null,null,null,0,0,0,{"$error":"#DIV/0!"},{"$error":"#DIV/0!"},{"$error":"#DIV/0!"},{"$error":"#DIV/0!"},{"$error":"#DIV/0!"},{"$error":"#DIV/0!"},{"$error":"#DIV/0!"},{"$f":"IF(A162=\"m\",VLOOKUP(P162,Berechnung_Male!$A$1:$D$42,AA162,TRUE),VLOOKUP(Eingabeblatt!P162,Berechnung_Female!$A$1:$D$42,AA162,TRUE))","v":{"$error":"#DIV/0!"}},{"$error":"#DIV/0!"},null,null,null,{"$error":"#DIV/0!"}]
[null,null,null,null,null,null,null,0,null,null,null,0,0,0,{"$error":"#DIV/0!"},{"$error":"#DIV/0!"},{"$error":"#DIV/0!"},{"$error":"#DIV/0!"},{"$error":"#DIV/0!"},{"$error":"#DIV/0!"},{"$error":"#DIV/0!"},{"$f":"IF(A163=\"m\",VLOOKUP(P163,Berechnung_Male!$A$1:$D$42,AA163,TRUE),VLOOKUP(Eingabeblatt!P163,Berechnung_Female!$A$1:$D$42,AA163,TRUE))","v":{"$error":"#DIV/0!"}},{"$error":"#DIV/0!"},null,null,null,{"$error":"#DIV/0!"}]
[null,null,null,null,null,null,null,0,null,null,null,0,0,0,{"$error":"#DIV/0!"},{"$error":"#DIV/0!"},{"$error":"#DIV/0!"},{"$error":"#DIV/0!"},{"$error":"#DIV/0!"},{"$error":"#DIV/0!"},{"$error":"#DIV/0!"},{"$f":"IF(A164=\"m\",VLOOKUP(P164,Berechnung_Male!$A$1:$D$42,AA164,TRUE),VLOOKUP(Eingabeblatt!P164,Berechnung_Female!$A$1:$D$42,AA164,TRUE))","v":{"$error":"#DIV/0!"}},{"$error":"#DIV/0!"},null,null,null,{"$error":"#DIV/0!"}]
[null,null,null,null,null,null,null,0,null,null,null,0,0,0,{"$error":"#DIV/0!"},{"$error":"#DIV/0!"},{"$error":"#DIV/0!"},{"$error":"#DIV/0!"},{"$error":"#DIV/0!"},{"$error":"#DIV/0!"},{"$error":"#DIV/0!"},{"$f":"IF(A165=\"m\",VLOOKUP(P165,Berechnung_Male!$A$1:$D$42,AA165,TRUE),VLOOKUP(Eingabeblatt!P165,Berechnung_Female!$A$1:$D$42,AA165,TRUE))","v":{"$error":"#DIV/0!"}},{"$error":"#DIV/0!"},null,null,null,{"$error":"#DIV/0!"}]
[null,null,null,null,null,null,null,0,null,null,null,0,0,0,{"$error":"#DIV/0!"},{"$error":"#DIV/0!"},{"$error":"#DIV/0!"},{"$error":"#DIV/0!"},{"$error":"#DIV/0!"},{"$error":"#DIV/0!"},{"$error":"#DIV/0!"},{"$f":"IF(A166=\"m\",VLOOKUP(P166,Berechnung_Male!$A$1:$D$42,AA166,TRUE),VLOOKUP(Eingabeblatt!P166,Berechnung_Female!$A$1:$D$42,AA166,TRUE))","v":{"$error":"#DIV/0!"}},{"$error":"#DIV/0!"},null,null,null,{"$error":"#DIV/0!"}]
[null,null,null,null,null,null,null,0,null,null,null,0,0,0,{"$error":"#DIV/0!"},{"$error":"#DIV/0!"},{"$error":"#DIV/0!"},{"$error":"#DIV/0!"},{"$error":"#DIV/0!"},{"$error":"#DIV/0!"},{"$error":"#DIV/0!"},{"$f":"IF(A167=\"m\",VLOOKUP(P167,Berechnung_Male!$A$1:$D$42,AA167,TRUE),VLOOKUP(Eingabeblatt!P167,Berechnung_Female!$A$1:$D$42,AA167,TRUE))","v":{"$error":"#DIV/0!"}},{"$error":"#DIV/0!"},null,null,null,{"$error":"#DIV/0!"}]
[null,null,null,null,null,null,null,0,null,null,null,0,0,0,{"$error":"#DIV/0!"},{"$error":"#DIV/0!"},{"$error":"#DIV/0!"},{"$error":"#DIV/0!"},{"$error":"#DIV/0!"},{"$error":"#DIV/0!"},{"$error":"#DIV/0!"},{"$f":"IF(A168=\"m\",VLOOKUP(P168,Berechnung_Male!$A$1:$D$42,AA168,TRUE),VLOOKUP(Eingabeblatt!P168,Berechnung_Female!$A$1:$D$42,AA168,TRUE))","v":{"$error":"#DIV/0!"}},{"$error":"#DIV/0!"},null,null,null,{"$error":"#DIV/0!"}]
[null,null,null,null,null,null,null,0,null,null,null,0,0,0,{"$error":"#DIV/0!"},{"$error":"#DIV/0!"},{"$error":"#DIV/0!"},{"$error":"#DIV/0!"},{"$error":"#DIV/0!"},{"$error":"#DIV/0!"},{"$error":"#DIV/0!"},{"$f":"IF(A169=\"m\",VLOOKUP(P169,Berechnung_Male!$A$1:$D$42,AA169,TRUE),VLOOKUP(Eingabeblatt!P169,Berechnung_Female!$A$1:$D$42,AA169,TRUE))","v":{"$error":"#DIV/0!"}},{"$error":"#DIV/0!"},null,null,null,{"$error":"#DIV/0!"}]
[null,null,null,null,null,null,null,0,null,null,null,0,0,0,{"$error":"#DIV/0!"},{"$error":"#DIV/0!"},{"$error":"#DIV/0!"},{"$error":"#DIV/0!"},{"$error":"#DIV/0!"},{"$error":"#DIV/0!"},{"$error":"#DIV/0!"},{"$f":"IF(A170=\"m\",VLOOKUP(P170,Berechnung_Male!$A$1:$D$42,AA170,TRUE),VLOOKUP(Eingabeblatt!P170,Berechnung_Female!$A$1:$D$42,AA170,TRUE))","v":{"$error":"#DIV/0!"}},{"$error":"#DIV/0!"},null,null,null,{"$error":"#DIV/0!"}]
[null,null,null,null,null,null,null,0,null,null,null,0,0,0,{"$error":"#DIV/0!"},{"$error":"#DIV/0!"},{"$error":"#DIV/0!"},{"$error":"#DIV/0!"},{"$error":"#DIV/0!"},{"$error":"#DIV/0!"},{"$error":"#DIV/0!"},{"$f":"IF(A171=\"m\",VLOOKUP(P171,Berechnung_Male!$A$1:$D$42,AA171,TRUE),VLOOKUP(Eingabeblatt!P171,Berechnung_Female!$A$1:$D$42,AA171,TRUE))","v":{"$error":"#DIV/0!"}},{"$error":"#DIV/0!"},null,null,null,{"$error":"#DIV/0!"}]
[null,null,null,null,null,null,null,0,null,null,null,0,0,0,{"$error":"#DIV/0!"},{"$error":"#DIV/0!"},{"$error":"#DIV/0!"},{"$error":"#DIV/0!"},{"$error":"#DIV/0!"},{"$error":"#DIV/0!"},{"$error":"#DIV/0!"},{"$f":"IF(A172=\"m\",VLOOKUP(P172,Berechnung_Male!$A$1:$D$42,AA172,TRUE),VLOOKUP(Eingabeblatt!P172,Berechnung_Female!$A$1:$D$42,AA172,TRUE))","v":{"$error":"#DIV/0!"}},{"$error":"#DIV/0!"},null,null,null,{"$error":"#DIV/0!"}]
[null,null,null,null,null,null,null,0,null,null,null,0,0,0,{"$error":"#DIV/0!"},{"$error":"#DIV/0!"},{"$error":"#DIV/0!"},{"$error":"#DIV/0!"},{"$error":"#DIV/0!"},{"$error":"#DIV/0!"},{"$error":"#DIV/0!"},{"$f":"IF(A173=\"m\",VLOOKUP(P173,Berechnung_Male!$A$1:$D$42,AA173,TRUE),VLOOKUP(Eingabeblatt!P173,Berechnung_Female!$A$1:$D$42,AA173,TRUE))","v":{"$error":"#DIV/0!"}},{"$error":"#DIV/0!"},null,null,null,{"$error":"#DIV/0!"}]
[null,null,null,null,null,null,null,0,null,null,null,0,0,0,{"$error":"#DIV/0!"},{"$error":"#DIV/0!"},{"$error":"#DIV/0!"},{"$error":"#DIV/0!"},{"$error":"#DIV/0!"},{"$error":"#DIV/0!"},{"$error":"#DIV/0!"},{"$f":"IF(A174=\"m\",VLOOKUP(P174,Berechnung_Male!$A$1:$D$42,AA174,TRUE),VLOOKUP(Eingabeblatt!P174,Berechnung_Female!$A$1:$D$42,AA174,TRUE))","v":{"$error":"#DIV/0!"}},{"$error":"#DIV/0!"},null,null,null,{"$error":"#DIV/0!"}]
[null,null,null,null,null,null,null,0,null,null,null,0,0,0,{"$error":"#DIV/0!"},{"$error":"#DIV/0!"},{"$error":"#DIV/0!"},{"$error":"#DIV/0!"},{"$error":"#DIV/0!"},{"$error":"#DIV/0!"},{"$error":"#DIV/0!"},{"$f":"IF(A175=\"m\",VLOOKUP(P175,Berechnung_Male!$A$1:$D$42,AA175,TRUE),VLOOKUP(Eingabeblatt!P175,Berechnung_Female!$A$1:$D$42,AA175,TRUE))","v":{"$error":"#DIV/0!"}},{"$error":"#DIV/0!"},null,null,null,{"$error":"#DIV/0!"}]
[null,null,null,null,null,null,null,0,null,null,null,0,0,0,{"$error":"#DIV/0!"},{"$error":"#DIV/0!"},{"$error":"#DIV/0!"},{"$error":"#DIV/0!"},{"$error":"#DIV/0!"},{"$error":"#DIV/0!"},{"$error":"#DIV/0!"},{"$f":"IF(A176=\"m\",VLOOKUP(P176,Berechnung_Male!$A$1:$D$42,AA176,TRUE),VLOOKUP(Eingabeblatt!P176,Berechnung_Female!$A$1:$D$42,AA176,TRUE))","v":{"$error":"#DIV/0!"}},{"$error":"#DIV/0!"},null,null,null,{"$error":"#DIV/0!"}]
[null,null,null,null,null,null,null,0,null,null,null,0,0,0,{"$error":"#DIV/0!"},{"$error":"#DIV/0!"},{"$error":"#DIV/0!"},{"$error":"#DIV/0!"},{"$error":"#DIV/0!"},{"$error":"#DIV/0!"},{"$error":"#DIV/0!"},{"$f":"IF(A177=\"m\",VLOOKUP(P177,Berechnung_Male!$A$1:$D$42,AA177,TRUE),VLOOKUP(Eingabeblatt!P177,Berechnung_Female!$A$1:$D$42,AA177,TRUE))","v":{"$error":"#DIV/0!"}},{"$error":"#DIV/0!"},null,null,null,{"$error":"#DIV/0!"}]
[null,null,null,null,null,null,null,0,null,null,null,0,0,0,{"$error":"#DIV/0!"},{"$error":"#DIV/0!"},{"$error":"#DIV/0!"},{"$error":"#DIV/0!"},{"$error":"#DIV/0!"},{"$error":"#DIV/0!"},{"$error":"#DIV/0!"},{"$f":"IF(A178=\"m\",VLOOKUP(P178,Berechnung_Male!$A$1:$D$42,AA178,TRUE),VLOOKUP(Eingabeblatt!P178,Berechnung_Female!$A$1:$D$42,AA178,TRUE))","v":{"$error":"#DIV/0!"}},{"$error":"#DIV/0!"},null,null,null,{"$error":"#DIV/0!"}]
[null,null,null,null,null,null,null,0,null,null,null,0,0,0,{"$error":"#DIV/0!"},{"$error":"#DIV/0!"},{"$error":"#DIV/0!"},{"$error":"#DIV/0!"},{"$error":"#DIV/0!"},{"$error":"#DIV/0!"},{"$error":"#DIV/0!"},{"$f":"IF(A179=\"m\",VLOOKUP(P179,Berechnung_Male!$A$1:$D$42,AA179,TRUE),VLOOKUP(Eingabeblatt!P179,Berechnung_Female!$A$1:$D$42,AA179,TRUE))","v":{"$error":"#DIV/0!"}},{"$error":"#DIV/0!"},null,null,null,{"$error":"#DIV/0!"}]
[null,null,null,null,null,null,null,0,null,null,null,0,0,0,{"$error":"#DIV/0!"},{"$error":"#DIV/0!"},{"$error":"#DIV/0!"},{"$error":"#DIV/0!"},{"$error":"#DIV/0!"},{"$error":"#DIV/0!"},{"$error":"#DIV/0!"},{"$f":"IF(A180=\"m\",VLOOKUP(P180,Berechnung_Male!$A$1:$D$42,AA180,TRUE),VLOOKUP(Eingabeblatt!P180,Berechnung_Female!$A$1:$D$42,AA180,TRUE))","v":{"$error":"#DIV/0!"}},{"$error":"#DIV/0!"},null,null,null,{"$error":"#DIV/0!"}]
[null,null,null,null,null,null,null,0,null,null,null,0,0,0,{"$error":"#DIV/0!"},{"$error":"#DIV/0!"},{"$error":"#DIV/0!"},{"$error":"#DIV/0!"},{"$error":"#DIV/0!"},{"$error":"#DIV/0!"},{"$error":"#DIV/0!"},{"$f":"IF(A181=\"m\",VLOOKUP(P181,Berechnung_Male!$A$1:$D$42,AA181,TRUE),VLOOKUP(Eingabeblatt!P181,Berechnung_Female!$A$1:$D$42,AA181,TRUE))","v":{"$error":"#DIV/0!"}},{"$error":"#DIV/0!"},null,null,null,{"$error":"#DIV/0!"}]
[null,null,null,null,null,null,null,0,null,null,null,0,0,0,{"$error":"#DIV/0!"},{"$error":"#DIV/0!"},{"$error":"#DIV/0!"},{"$error":"#DIV/0!"},{"$error":"#DIV/0!"},{"$error":"#DIV/0!"},{"$error":"#DIV/0!"},{"$f":"IF(A182=\"m\",VLOOKUP(P182,Berechnung_Male!$A$1:$D$42,AA182,TRUE),VLOOKUP(Eingabeblatt!P182,Berechnung_Female!$A$1:$D$42,AA182,TRUE))","v":{"$error":"#DIV/0!"}},{"$error":"#DIV/0!"},null,null,null,{"$error":"#DIV/0!"}]
[null,null,null,null,null,null,null,0,null,null,null,0,0,0,{"$error":"#DIV/0!"},{"$error":"#DIV/0!"},{"$error":"#DIV/0!"},{"$error":"#DIV/0!"},{"$error":"#DIV/0!"},{"$error":"#DIV/0!"},{"$error":"#DIV/0!"},{"$f":"IF(A183=\"m\",VLOOKUP(P183,Berechnung_Male!$A$1:$D$42,AA183,TRUE),VLOOKUP(Eingabeblatt!P183,Berechnung_Female!$A$1:$D$42,AA183,TRUE))","v":{"$error":"#DIV/0!"}},{"$error":"#DIV/0!"},null,null,null,{"$error":"#DIV/0!"}]
[null,null,null,null,null,null,null,0,null,null,null,0,0,0,{"$error":"#DIV/0!"},{"$error":"#DIV/0!"},{"$error":"#DIV/0!"},{"$error":"#DIV/0!"},{"$error":"#DIV/0!"},{"$error":"#DIV/0!"},{"$error":"#DIV/0!"},{"$f":"IF(A184=\"m\",VLOOKUP(P184,Berechnung_Male!$A$1:$D$42,AA184,TRUE),VLOOKUP(Eingabeblatt!P184,Berechnung_Female!$A$1:$D$42,AA184,TRUE))","v":{"$error":"#DIV/0!"}},{"$error":"#DIV/0!"},null,null,null,{"$error":"#DIV/0!"}]
[null,null,null,null,null,null,null,0,null,null,null,0,0,0,{"$error":"#DIV/0!"},{"$error":"#DIV/0!"},{"$error":"#DIV/0!"},{"$error":"#DIV/0!"},{"$error":"#DIV/0!"},{"$error":"#DIV/0!"},{"$error":"#DIV/0!"},{"$f":"IF(A185=\"m\",VLOOKUP(P185,Berechnung_Male!$A$1:$D$42,AA185,TRUE),VLOOKUP(Eingabeblatt!P185,Berechnung_Female!$A$1:$D$42,AA185,TRUE))","v":{"$error":"#DIV/0!"}},{"$error":"#DIV/0!"},null,null,null,{"$error":"#DIV/0!"}]
[null,null,null,null,null,null,null,0,null,null,null,0,0,0,{"$error":"#DIV/0!"},{"$error":"#DIV/0!"},{"$error":"#DIV/0!"},{"$error":"#DIV/0!"},{"$error":"#DIV/0!"},{"$error":"#DIV/0!"},{"$error":"#DIV/0!"},{"$f":"IF(A186=\"m\",VLOOKUP(P186,Berechnung_Male!$A$1:$D$42,AA186,TRUE),VLOOKUP(Eingabeblatt!P186,Berechnung_Female!$A$1:$D$42,AA186,TRUE))","v":{"$error":"#DIV/0!"}},{"$error":"#DIV/0!"},null,null,null,{"$error":"#DIV/0!"}]
[null,null,null,null,null,null,null,0,null,null,null,0,0,0,{"$error":"#DIV/0!"},{"$error":"#DIV/0!"},{"$error":"#DIV/0!"},{"$error":"#DIV/0!"},{"$error":"#DIV/0!"},{"$error":"#DIV/0!"},{"$error":"#DIV/0!"},{"$f":"IF(A187=\"m\",VLOOKUP(P187,Berechnung_Male!$A$1:$D$42,AA187,TRUE),VLOOKUP(Eingabeblatt!P187,Berechnung_Female!$A$1:$D$42,AA187,TRUE))","v":{"$error":"#DIV/0!"}},{"$error":"#DIV/0!"},null,null,null,{"$error":"#DIV/0!"}]
[null,null,null,null,null,null,null,0,null,null,null,0,0,0,{"$error":"#DIV/0!"},{"$error":"#DIV/0!"},{"$error":"#DIV/0!"},{"$error":"#DIV/0!"},{"$error":"#DIV/0!"},{"$error":"#DIV/0!"},{"$error":"#DIV/0!"},{"$f":"IF(A188=\"m\",VLOOKUP(P188,Berechnung_Male!$A$1:$D$42,AA188,TRUE),VLOOKUP(Eingabeblatt!P188,Berechnung_Female!$A$1:$D$42,AA188,TRUE))","v":{"$error":"#DIV/0!"}},{"$error":"#DIV/0!"},null,null,null,{"$error":"#DIV/0!"}]
[null,null,null,null,null,null,null,0,null,null,null,0,0,0,{"$error":"#DIV/0!"},{"$error":"#DIV/0!"},{"$error":"#DIV/0!"},{"$error":"#DIV/0!"},{"$error":"#DIV/0!"},{"$error":"#DIV/0!"},{"$error":"#DIV/0!"},{"$f":"IF(A189=\"m\",VLOOKUP(P189,Berechnung_Male!$A$1:$D$42,AA189,TRUE),VLOOKUP(Eingabeblatt!P189,Berechnung_Female!$A$1:$D$42,AA189,TRUE))","v":{"$error":"#DIV/0!"}},{"$error":"#DIV/0!"},null,null,null,{"$error":"#DIV/0!"}]
[null,null,null,null,null,null,null,0,null,null,null,0,0,0,{"$error":"#DIV/0!"},{"$error":"#DIV/0!"},{"$error":"#DIV/0!"},{"$error":"#DIV/0!"},{"$error":"#DIV/0!"},{"$error":"#DIV/0!"},{"$error":"#DIV/0!"},{"$f":"IF(A190=\"m\",VLOOKUP(P190,Berechnung_Male!$A$1:$D$42,AA190,TRUE),VLOOKUP(Eingabeblatt!P190,Berechnung_Female!$A$1:$D$42,AA190,TRUE))","v":{"$error":"#DIV/0!"}},{"$error":"#DIV/0!"},null,null,null,{"$error":"#DIV/0!"}]
[null,null,null,null,null,null,null,0,null,null,null,0,0,0,{"$error":"#DIV/0!"},{"$error":"#DIV/0!"},{"$error":"#DIV/0!"},{"$error":"#DIV/0!"},{"$error":"#DIV/0!"},{"$error":"#DIV/0!"},{"$error":"#DIV/0!"},{"$f":"IF(A191=\"m\",VLOOKUP(P191,Berechnung_Male!$A$1:$D$42,AA191,TRUE),VLOOKUP(Eingabeblatt!P191,Berechnung_Female!$A$1:$D$42,AA191,TRUE))","v":{"$error":"#DIV/0!"}},{"$error":"#DIV/0!"},null,null,null,{"$error":"#DIV/0!"}]
[null,null,null,null,null,null,null,0,null,null,null,0,0,0,{"$error":"#DIV/0!"},{"$error":"#DIV/0!"},{"$error":"#DIV/0!"},{"$error":"#DIV/0!"},{"$error":"#DIV/0!"},{"$error":"#DIV/0!"},{"$error":"#DIV/0!"},{"$f":"IF(A192=\"m\",VLOOKUP(P192,Berechnung_Male!$A$1:$D$42,AA192,TRUE),VLOOKUP(Eingabeblatt!P192,Berechnung_Female!$A$1:$D$42,AA192,TRUE))","v":{"$error":"#DIV/0!"}},{"$error":"#DIV/0!"},null,null,null,{"$error":"#DIV/0!"}]
[null,null,null,null,null,null,null,0,null,null,null,0,0,0,{"$error":"#DIV/0!"},{"$error":"#DIV/0!"},{"$error":"#DIV/0!"},{"$error":"#DIV/0!"},{"$error":"#DIV/0!"},{"$error":"#DIV/0!"},{"$error":"#DIV/0!"},{"$f":"IF(A193=\"m\",VLOOKUP(P193,Berechnung_Male!$A$1:$D$42,AA193,TRUE),VLOOKUP(Eingabeblatt!P193,Berechnung_Female!$A$1:$D$42,AA193,TRUE))","v":{"$error":"#DIV/0!"}},{"$error":"#DIV/0!"},null,null,null,{"$error":"#DIV/0!"}]
[null,null,null,null,null,null,null,0,null,null,null,0,0,0,{"$error":"#DIV/0!"},{"$error":"#DIV/0!"},{"$error":"#DIV/0!"},{"$error":"#DIV/0!"},{"$error":"#DIV/0!"},{"$error":"#DIV/0!"},{"$error":"#DIV/0!"},{"$f":"IF(A194=\"m\",VLOOKUP(P194,Berechnung_Male!$A$1:$D$42,AA194,TRUE),VLOOKUP(Eingabeblatt!P194,Berechnung_Female!$A$1:$D$42,AA194,TRUE))","v":{"$error":"#DIV/0!"}},{"$error":"#DIV/0!"},null,null,null,{"$error":"#DIV/0!"}]
[null,null,null,null,null,null,null,0,null,null,null,0,0,0,{"$error":"#DIV/0!"},{"$error":"#DIV/0!"},{"$error":"#DIV/0!"},{"$error":"#DIV/0!"},{"$error":"#DIV/0!"},{"$error":"#DIV/0!"},{"$error":"#DIV/0!"},{"$f":"IF(A195=\"m\",VLOOKUP(P195,Berechnung_Male!$A$1:$D$42,AA195,TRUE),VLOOKUP(Eingabeblatt!P195,Berechnung_Female!$A$1:$D$42,AA195,TRUE))","v":{"$error":"#DIV/0!"}},{"$error":"#DIV/0!"},null,null,null,{"$error":"#DIV/0!"}]
[null,null,null,null,null,null,null,0,null,null,null,0,0,0,{"$error":"#DIV/0!"},{"$error":"#DIV/0!"},{"$error":"#DIV/0!"},{"$error":"#DIV/0!"},{"$error":"#DIV/0!"},{"$error":"#DIV/0!"},{"$error":"#DIV/0!"},{"$f":"IF(A196=\"m\",VLOOKUP(P196,Berechnung_Male!$A$1:$D$42,AA196,TRUE),VLOOKUP(Eingabeblatt!P196,Berechnung_Female!$A$1:$D$42,AA196,TRUE))","v":{"$error":"#DIV/0!"}},{"$error":"#DIV/0!"},null,null,null,{"$error":"#DIV/0!"}]
[null,null,null,null,null,null,null,0,null,null,null,0,0,0,{"$error":"#DIV/0!"},{"$error":"#DIV/0!"},{"$error":"#DIV/0!"},{"$error":"#DIV/0!"},{"$f":"IF(A197=\"m\",(IF(O197<12.8,1,IF(O197<13.3,2,IF(O197>14.8,5,IF(O197>14.3,4,3))))),(IF(O197<11,1,IF(O197<11.5,2,IF(O197>13,5,IF(O197>12.5,4,3))))))","v":{"$error":"#DIV/0!"}},{"$error":"#DIV/0!"},{"$error":"#DIV/0!"},{"$f":"IF(A197=\"m\",VLOOKUP(P197,Berechnung_Male!$A$1:$D$42,AA197,TRUE),VLOOKUP(Eingabeblatt!P197,Berechnung_Female!$A$1:$D$42,AA197,TRUE))","v":{"$error":"#DIV/0!"}},{"$error":"#DIV/0!"},null,null,null,{"$f":"IF(A197=\"m\",IF(O197<12.8,2,IF(O197<14.8,3,4)),IF(O197<11,2,IF(O197<13,3,4)))","v":{"$error":"#DIV/0!"}}]
[null,null,null,null,null,null,null,{"$f":"F198-G198","v":0},null,null,null,{"$f":"J198-K198","v":0},{"$f":"I198-L198","v":0},{"$f":"(B198-E198)/365.25","v":0},{"$f":"N198-P198","v":{"$error":"#DIV/0!"}},{"$f":"IF(A198=\"m\",(-9.236+(0.0002708*M198*L198)+(-0.001663*N198*M198)+(0.007216*N198*L198)+(0.02292*H198/I198*100)),(-9.376+(0.0001882*M198*L198)+(0.0022*N198*M198)+(0.005841*N198*L198)-(0.002658*N198*H198)+(0.07693*(H198/I198)*100)))","v":{"$error":"#DIV/0!"}},{"$f":"IF(R198=1,\"Früh / précoce\",IF(R198=2,\"Durchschnittlich / Normal\",\"Spät / Tardif\"))","v":{"$error":"#DIV/0!"}},{"$f":"IF(A198=\"m\",(IF(O198<12.8,1,IF(O198>14.8,3,2))),(IF(O198<11,1,IF(O198>13,3,2))))","v":{"$error":"#DIV/0!"}},{"$error":"#DIV/0!"},{"$f":"IF(S198=1,\"Früh / précoce\",IF(S198=2,\"Möglicherweise Früh / éventuellement précoce\", IF(S198=3,\"Durchschnittlich / Normal\",IF(S198=4,\"Möglicherweise spät / éventuellement tardif\",\"Spät / Tardif\"))))","v":{"$error":"#DIV/0!"}},{"$f":"I198+V198","v":{"$error":"#DIV/0!"}},{"$f":"IF(A198=\"m\",VLOOKUP(P198,Berechnung_Male!$A$1:$D$42,AA198,TRUE),VLOOKUP(Eingabeblatt!P198,Berechnung_Female!$A$1:$D$42,AA198,TRUE))","v":{"$error":"#DIV/0!"}},{"$f":"I198/U198","v":{"$error":"#DIV/0!"}},null,null,null,{"$error":"#DIV/0!"}]
[null,null,null,null,null,null,null,0,null,null,null,0,0,0,{"$error":"#DIV/0!"},{"$error":"#DIV/0!"},{"$error":"#DIV/0!"},{"$error":"#DIV/0!"},{"$error":"#DIV/0!"},{"$error":"#DIV/0!"},{"$error":"#DIV/0!"},{"$f":"IF(A199=\"m\",VLOOKUP(P199,Berechnung_Male!$A$1:$D$42,AA199,TRUE),VLOOKUP(Eingabeblatt!P199,Berechnung_Female!$A$1:$D$42,AA199,TRUE))","v":{"$error":"#DIV/0!"}},{"$error":"#DIV/0!"},null,null,null,{"$error":"#DIV/0!"}]
[null,null,null,null,null,null,null,0,null,null,null,0,0,0,{"$error":"#DIV/0!"},{"$error":"#DIV/0!"},{"$error":"#DIV/0!"},{"$error":"#DIV/0!"},{"$error":"#DIV/0!"},{"$error":"#DIV/0!"},{"$error":"#DIV/0!"},{"$f":"IF(A200=\"m\",VLOOKUP(P200,Berechnung_Male!$A$1:$D$42,AA200,TRUE),VLOOKUP(Eingabeblatt!P200,Berechnung_Female!$A$1:$D$42,AA200,TRUE))","v":{"$error":"#DIV/0!"}},{"$error":"#DIV/0!"},null,null,null,{"$error":"#DIV/0!"}]
[null,null,null,null,null,null,null,0,null,null,null,0,0,0,{"$error":"#DIV/0!"},{"$error":"#DIV/0!"},{"$error":"#DIV/0!"},{"$error":"#DIV/0!"},{"$error":"#DIV/0!"},{"$error":"#DIV/0!"},{"$error":"#DIV/0!"},{"$f":"IF(A201=\"m\",VLOOKUP(P201,Berechnung_Male!$A$1:$D$42,AA201,TRUE),VLOOKUP(Eingabeblatt!P201,Berechnung_Female!$A$1:$D$42,AA201,TRUE))","v":{"$error":"#DIV/0!"}},{"$error":"#DIV/0!"},null,null,null,{"$error":"#DIV/0!"}]
[null,null,null,null,null,null,null,0,null,null,null,0,0,0,{"$error":"#DIV/0!"},{"$error":"#DIV/0!"},{"$error":"#DIV/0!"},{"$error":"#DIV/0!"},{"$error":"#DIV/0!"},{"$error":"#DIV/0!"},{"$error":"#DIV/0!"},{"$f":"IF(A202=\"m\",VLOOKUP(P202,Berechnung_Male!$A$1:$D$42,AA202,TRUE),VLOOKUP(Eingabeblatt!P202,Berechnung_Female!$A$1:$D$42,AA202,TRUE))","v":{"$error":"#DIV/0!"}},{"$error":"#DIV/0!"},null,null,null,{"$error":"#DIV/0!"}]
[null,null,null,null,null,null,null,0,null,null,null,0,0,0,{"$error":"#DIV/0!"},{"$error":"#DIV/0!"},{"$error":"#DIV/0!"},{"$error":"#DIV/0!"},{"$error":"#DIV/0!"},{"$error":"#DIV/0!"},{"$error":"#DIV/0!"},{"$f":"IF(A203=\"m\",VLOOKUP(P203,Berechnung_Male!$A$1:$D$42,AA203,TRUE),VLOOKUP(Eingabeblatt!P203,Berechnung_Female!$A$1:$D$42,AA203,TRUE))","v":{"$error":"#DIV/0!"}},{"$error":"#DIV/0!"},null,null,null,{"$error":"#DIV/0!"}]
[null,null,null,null,null,null,null,0,null,null,null,0,0,0,{"$error":"#DIV/0!"},{"$error":"#DIV/0!"},{"$error":"#DIV/0!"},{"$error":"#DIV/0!"},{"$error":"#DIV/0!"},{"$error":"#DIV/0!"},{"$error":"#DIV/0!"},{"$f":"IF(A204=\"m\",VLOOKUP(P204,Berechnung_Male!$A$1:$D$42,AA204,TRUE),VLOOKUP(Eingabeblatt!P204,Berechnung_Female!$A$1:$D$42,AA204,TRUE))","v":{"$error":"#DIV/0!"}},{"$error":"#DIV/0!"},null,null,null,{"$error":"#DIV/0!"}]
[null,null,null,null,null,null,null,0,null,null,null,0,0,0,{"$error":"#DIV/0!"},{"$error":"#DIV/0!"},{"$error":"#DIV/0!"},{"$error":"#DIV/0!"},{"$error":"#DIV/0!"},{"$error":"#DIV/0!"},{"$error":"#DIV/0!"},{"$f":"IF(A205=\"m\",VLOOKUP(P205,Berechnung_Male!$A$1:$D$42,AA205,TRUE),VLOOKUP(Eingabeblatt!P205,Berechnung_Female!$A$1:$D$42,AA205,TRUE))","v":{"$error":"#DIV/0!"}},{"$error":"#DIV/0!"},null,null,null,{"$error":"#DIV/0!"}]
[null,null,null,null,null,null,null,0,null,null,null,0,0,0,{"$error":"#DIV/0!"},{"$error":"#DIV/0!"},{"$error":"#DIV/0!"},{"$error":"#DIV/0!"},{"$error":"#DIV/0!"},{"$error":"#DIV/0!"},{"$error":"#DIV/0!"},{"$f":"IF(A206=\"m\",VLOOKUP(P206,Berechnung_Male!$A$1:$D$42,AA206,TRUE),VLOOKUP(Eingabeblatt!P206,Berechnung_Female!$A$1:$D$42,AA206,TRUE))","v":{"$error":"#DIV/0!"}},{"$error":"#DIV/0!"},null,null,null,{"$error":"#DIV/0!"}]
[null,null,null,null,null,null,null,0,null,null,null,0,0,0,{"$error":"#DIV/0!"},{"$error":"#DIV/0!"},{"$error":"#DIV/0!"},{"$error":"#DIV/0!"},{"$error":"#DIV/0!"},{"$error":"#DIV/0!"},{"$error":"#DIV/0!"},{"$f":"IF(A207=\"m\",VLOOKUP(P207,Berechnung_Male!$A$1:$D$42,AA207,TRUE),VLOOKUP(Eingabeblatt!P207,Berechnung_Female!$A$1:$D$42,AA207,TRUE))","v":{"$error":"#DIV/0!"}},{"$error":"#DIV/0!"},null,null,null,{"$error":"#DIV/0!"}]
[null,null,null,null,null,null,null,0,null,null,null,0,0,0,{"$error":"#DIV/0!"},{"$error":"#DIV/0!"},{"$error":"#DIV/0!"},{"$error":"#DIV/0!"},{"$error":"#DIV/0!"},{"$error":"#DIV/0!"},{"$error":"#DIV/0!"},{"$f":"IF(A208=\"m\",VLOOKUP(P208,Berechnung_Male!$A$1:$D$42,AA208,TRUE),VLOOKUP(Eingabeblatt!P208,Berechnung_Female!$A$1:$D$42,AA208,TRUE))","v":{"$error":"#DIV/0!"}},{"$error":"#DIV/0!"},null,null,null,{"$error":"#DIV/0!"}]
[null,null,null,null,null,null,null,0,null,null,null,0,0,0,{"$error":"#DIV/0!"},{"$error":"#DIV/0!"},{"$error":"#DIV/0!"},{"$error":"#DIV/0!"},{"$error":"#DIV/0!"},{"$error":"#DIV/0!"},{"$error":"#DIV/0!"},{"$f":"IF(A209=\"m\",VLOOKUP(P209,Berechnung_Male!$A$1:$D$42,AA209,TRUE),VLOOKUP(Eingabeblatt!P209,Berechnung_Female!$A$1:$D$42,AA209,TRUE))","v":{"$error":"#DIV/0!"}},{"$error":"#DIV/0!"},null,null,null,{"$error":"#DIV/0!"}]
[null,null,null,null,null,null,null,0,null,null,null,0,0,0,{"$error":"#DIV/0!"},{"$error":"#DIV/0!"},{"$error":"#DIV/0!"},{"$error":"#DIV/0!"},{"$error":"#DIV/0!"},{"$error":"#DIV/0!"},{"$error":"#DIV/0!"},{"$f":"IF(A210=\"m\",VLOOKUP(P210,Berechnung_Male!$A$1:$D$42,AA210,TRUE),VLOOKUP(Eingabeblatt!P210,Berechnung_Female!$A$1:$D$42,AA210,TRUE))","v":{"$error":"#DIV/0!"}},{"$error":"#DIV/0!"},null,null,null,{"$error":"#DIV/0!"}]
[null,null,null,null,null,null,null,0,null,null,null,0,0,0,{"$error":"#DIV/0!"},{"$error":"#DIV/0!"},{"$error":"#DIV/0!"},{"$error":"#DIV/0!"},{"$error":"#DIV/0!"},{"$error":"#DIV/0!"},{"$error":"#DIV/0!"},{"$f":"IF(A211=\"m\",VLOOKUP(P211,Berechnung_Male!$A$1:$D$42,AA211,TRUE),VLOOKUP(Eingabeblatt!P211,Berechnung_Female!$A$1:$D$42,AA211,TRUE))","v":{"$error":"#DIV/0!"}},{"$error":"#DIV/0!"},null,null,null,{"$error":"#DIV/0!"}]
[null,null,null,null,null,null,null,0,null,null,null,0,0,0,{"$error":"#DIV/0!"},{"$error":"#DIV/0!"},{"$error":"#DIV/0!"},{"$error":"#DIV/0!"},{"$error":"#DIV/0!"},{"$error":"#DIV/0!"},{"$error":"#DIV/0!"},{"$f":"IF(A212=\"m\",VLOOKUP(P212,Berechnung_Male!$A$1:$D$42,AA212,TRUE),VLOOKUP(Eingabeblatt!P212,Berechnung_Female!$A$1:$D$42,AA212,TRUE))","v":{"$error":"#DIV/0!"}},{"$error":"#DIV/0!"},null,null,null,{"$error":"#DIV/0!"}]
[null,null,null,null,null,null,null,0,null,null,null,0,0,0,{"$error":"#DIV/0!"},{"$error":"#DIV/0!"},{"$error":"#DIV/0!"},{"$error":"#DIV/0!"},{"$error":"#DIV/0!"},{"$error":"#DIV/0!"},{"$error":"#DIV/0!"},{"$f":"IF(A213=\"m\",VLOOKUP(P213,Berechnung_Male!$A$1:$D$42,AA213,TRUE),VLOOKUP(Eingabeblatt!P213,Berechnung_Female!$A$1:$D$42,AA213,TRUE))","v":{"$error":"#DIV/0!"}},{"$error":"#DIV/0!"},null,null,null,{"$error":"#DIV/0!"}]
[null,null,null,null,null,null,null,0,null,null,null,0,0,0,{"$error":"#DIV/0!"},{"$error":"#DIV/0!"},{"$error":"#DIV/0!"},{"$error":"#DIV/0!"},{"$error":"#DIV/0!"},{"$error":"#DIV/0!"},{"$error":"#DIV/0!"},{"$f":"IF(A214=\"m\",VLOOKUP(P214,Berechnung_Male!$A$1:$D$42,AA214,TRUE),VLOOKUP(Eingabeblatt!P214,Berechnung_Female!$A$1:$D$42,AA214,TRUE))","v":{"$error":"#DIV/0!"}},{"$error":"#DIV/0!"},null,null,null,{"$error":"#DIV/0!"}]
[null,null,null,null,null,null,null,0,null,null,null,0,0,0,{"$error":"#DIV/0!"},{"$error":"#DIV/0!"},{"$error":"#DIV/0!"},{"$error":"#DIV/0!"},{"$error":"#DIV/0!"},{"$error":"#DIV/0!"},{"$error":"#DIV/0!"},{"$f":"IF(A215=\"m\",VLOOKUP(P215,Berechnung_Male!$A$1:$D$42,AA215,TRUE),VLOOKUP(Eingabeblatt!P215,Berechnung_Female!$A$1:$D$42,AA215,TRUE))","v":{"$error":"#DIV/0!"}},{"$error":"#DIV/0!"},null,null,null,{"$error":"#DIV/0!"}]
[null,null,null,null,null,null,null,0,null,null,null,0,0,0,{"$error":"#DIV/0!"},{"$error":"#DIV/0!"},{"$error":"#DIV/0!"},{"$error":"#DIV/0!"},{"$error":"#DIV/0!"},{"$error":"#DIV/0!"},{"$error":"#DIV/0!"},{"$f":"IF(A216=\"m\",VLOOKUP(P216,Berechnung_Male!$A$1:$D$42,AA216,TRUE),VLOOKUP(Eingabeblatt!P216,Berechnung_Female!$A$1:$D$42,AA216,TRUE))","v":{"$error":"#DIV/0!"}},{"$error":"#DIV/0!"},null,null,null,{"$error":"#DIV/0!"}]
[null,null,null,null,null,null,null,0,null,null,null,0,0,0,{"$error":"#DIV/0!"},{"$error":"#DIV/0!"},{"$error":"#DIV/0!"},{"$error":"#DIV/0!"},{"$error":"#DIV/0!"},{"$error":"#DIV/0!"},{"$error":"#DIV/0!"},{"$f":"IF(A217=\"m\",VLOOKUP(P217,Berechnung_Male!$A$1:$D$42,AA217,TRUE),VLOOKUP(Eingabeblatt!P217,Berechnung_Female!$A$1:$D$42,AA217,TRUE))","v":{"$error":"#DIV/0!"}},{"$error":"#DIV/0!"},null,null,null,{"$error":"#DIV/0!"}]
[null,null,null,null,null,null,null,0,null,null,null,0,0,0,{"$error":"#DIV/0!"},{"$error":"#DIV/0!"},{"$error":"#DIV/0!"},{"$error":"#DIV/0!"},{"$error":"#DIV/0!"},{"$error":"#DIV/0!"},{"$error":"#DIV/0!"},{"$f":"IF(A218=\"m\",VLOOKUP(P218,Berechnung_Male!$A$1:$D$42,AA218,TRUE),VLOOKUP(Eingabeblatt!P218,Berechnung_Female!$A$1:$D$42,AA218,TRUE))","v":{"$error":"#DIV/0!"}},{"$error":"#DIV/0!"},null,null,null,{"$error":"#DIV/0!"}]
[null,null,null,null,null,null,null,0,null,null,null,0,0,0,{"$error":"#DIV/0!"},{"$error":"#DIV/0!"},{"$error":"#DIV/0!"},{"$error":"#DIV/0!"},{"$error":"#DIV/0!"},{"$error":"#DIV/0!"},{"$error":"#DIV/0!"},{"$f":"IF(A219=\"m\",VLOOKUP(P219,Berechnung_Male!$A$1:$D$42,AA219,TRUE),VLOOKUP(Eingabeblatt!P219,Berechnung_Female!$A$1:$D$42,AA219,TRUE))","v":{"$error":"#DIV/0!"}},{"$error":"#DIV/0!"},null,null,null,{"$error":"#DIV/0!"}]
[null,null,null,null,null,null,null,0,null,null,null,0,0,0,{"$error":"#DIV/0!"},{"$error":"#DIV/0!"},{"$error":"#DIV/0!"},{"$error":"#DIV/0!"},{"$error":"#DIV/0!"},{"$error":"#DIV/0!"},{"$error":"#DIV/0!"},{"$f":"IF(A220=\"m\",VLOOKUP(P220,Berechnung_Male!$A$1:$D$42,AA220,TRUE),VLOOKUP(Eingabeblatt!P220,Berechnung_Female!$A$1:$D$42,AA220,TRUE))","v":{"$error":"#DIV/0!"}},{"$error":"#DIV/0!"},null,null,null,{"$error":"#DIV/0!"}]
[null,null,null,null,null,null,null,0,null,null,null,0,0,0,{"$error":"#DIV/0!"},{"$error":"#DIV/0!"},{"$error":"#DIV/0!"},{"$error":"#DIV/0!"},{"$error":"#DIV/0!"},{"$error":"#DIV/0!"},{"$error":"#DIV/0!"},{"$f":"IF(A221=\"m\",VLOOKUP(P221,Berechnung_Male!$A$1:$D$42,AA221,TRUE),VLOOKUP(Eingabeblatt!P221,Berechnung_Female!$A$1:$D$42,AA221,TRUE))","v":{"$error":"#DIV/0!"}},{"$error":"#DIV/0!"},null,null,null,{"$error":"#DIV/0!"}]
[null,null,null,null,null,null,null,0,null,null,null,0,0,0,{"$error":"#DIV/0!"},{"$error":"#DIV/0!"},{"$error":"#DIV/0!"},{"$error":"#DIV/0!"},{"$error":"#DIV/0!"},{"$error":"#DIV/0!"},{"$error":"#DIV/0!"},{"$f":"IF(A222=\"m\",VLOOKUP(P222,Berechnung_Male!$A$1:$D$42,AA222,TRUE),VLOOKUP(Eingabeblatt!P222,Berechnung_Female!$A$1:$D$42,AA222,TRUE))","v":{"$error":"#DIV/0!"}},{"$error":"#DIV/0!"},null,null,null,{"$error":"#DIV/0!"}]
[null,null,null,null,null,null,null,0,null,null,null,0,0,0,{"$error":"#DIV/0!"},{"$error":"#DIV/0!"},{"$error":"#DIV/0!"},{"$error":"#DIV/0!"},{"$error":"#DIV/0!"},{"$error":"#DIV/0!"},{"$error":"#DIV/0!"},{"$f":"IF(A223=\"m\",VLOOKUP(P223,Berechnung_Male!$A$1:$D$42,AA223,TRUE),VLOOKUP(Eingabeblatt!P223,Berechnung_Female!$A$1:$D$42,AA223,TRUE))","v":{"$error":"#DIV/0!"}},{"$error":"#DIV/0!"},null,null,null,{"$error":"#DIV/0!"}]
[null,null,null,null,null,null,null,0,null,null,null,0,0,0,{"$error":"#DIV/0!"},{"$error":"#DIV/0!"},{"$error":"#DIV/0!"},{"$error":"#DIV/0!"},{"$error":"#DIV/0!"},{"$error":"#DIV/0!"},{"$error":"#DIV/0!"},{"$f":"IF(A224=\"m\",VLOOKUP(P224,Berechnung_Male!$A$1:$D$42,AA224,TRUE),VLOOKUP(Eingabeblatt!P224,Berechnung_Female!$A$1:$D$42,AA224,TRUE))","v":{"$error":"#DIV/0!"}},{"$error":"#DIV/0!"},null,null,null,{"$error":"#DIV/0!"}]
[null,null,null,null,null,null,null,0,null,null,null,0,0,0,{"$error":"#DIV/0!"},{"$error":"#DIV/0!"},{"$error":"#DIV/0!"},{"$error":"#DIV/0!"},{"$error":"#DIV/0!"},{"$error":"#DIV/0!"},{"$error":"#DIV/0!"},{"$f":"IF(A225=\"m\",VLOOKUP(P225,Berechnung_Male!$A$1:$D$42,AA225,TRUE),VLOOKUP(Eingabeblatt!P225,Berechnung_Female!$A$1:$D$42,AA225,TRUE))","v":{"$error":"#DIV/0!"}},{"$error":"#DIV/0!"},null,null,null,{"$error":"#DIV/0!"}]
[null,null,null,null,null,null,null,0,null,null,null,0,0,0,{"$error":"#DIV/0!"},{"$error":"#DIV/0!"},{"$error":"#DIV/0!"},{"$error":"#DIV/0!"},{"$error":"#DIV/0!"},{"$error":"#DIV/0!"},{"$error":"#DIV/0!"},{"$f":"IF(A226=\"m\",VLOOKUP(P226,Berechnung_Male!$A$1:$D$42,AA226,TRUE),VLOOKUP(Eingabeblatt!P226,Berechnung_Female!$A$1:$D$42,AA226,TRUE))","v":{"$error":"#DIV/0!"}},{"$error":"#DIV/0!"},null,null,null,{"$error":"#DIV/0!"}]
[null,null,null,null,null,null,null,0,null,null,null,0,0,0,{"$error":"#DIV/0!"},{"$error":"#DIV/0!"},{"$error":"#DIV/0!"},{"$error":"#DIV/0!"},{"$error":"#DIV/0!"},{"$error":"#DIV/0!"},{"$error":"#DIV/0!"},{"$f":"IF(A227=\"m\",VLOOKUP(P227,Berechnung_Male!$A$1:$D$42,AA227,TRUE),VLOOKUP(Eingabeblatt!P227,Berechnung_Female!$A$1:$D$42,AA227,TRUE))","v":{"$error":"#DIV/0!"}},{"$error":"#DIV/0!"},null,null,null,{"$error":"#DIV/0!"}]
[null,null,null,null,null,null,null,0,null,null,null,0,0,0,{"$error":"#DIV/0!"},{"$error":"#DIV/0!"},{"$error":"#DIV/0!"},{"$error":"#DIV/0!"},{"$error":"#DIV/0!"},{"$error":"#DIV/0!"},{"$error":"#DIV/0!"},{"$f":"IF(A228=\"m\",VLOOKUP(P228,Berechnung_Male!$A$1:$D$42,AA228,TRUE),VLOOKUP(Eingabeblatt!P228,Berechnung_Female!$A$1:$D$42,AA228,TRUE))","v":{"$error":"#DIV/0!"}},{"$error":"#DIV/0!"},null,null,null,{"$error":"#DIV/0!"}]
[null,null,null,null,null,null,null,0,null,null,null,0,0,0,{"$error":"#DIV/0!"},{"$error":"#DIV/0!"},{"$error":"#DIV/0!"},{"$error":"#DIV/0!"},{"$error":"#DIV/0!"},{"$error":"#DIV/0!"},{"$error":"#DIV/0!"},{"$f":"IF(A229=\"m\",VLOOKUP(P229,Berechnung_Male!$A$1:$D$42,AA229,TRUE),VLOOKUP(Eingabeblatt!P229,Berechnung_Female!$A$1:$D$42,AA229,TRUE))","v":{"$error":"#DIV/0!"}},{"$error":"#DIV/0!"},null,null,null,{"$error":"#DIV/0!"}]
[null,null,null,null,null,null,null,0,null,null,null,0,0,0,{"$error":"#DIV/0!"},{"$error":"#DIV/0!"},{"$error":"#DIV/0!"},{"$error":"#DIV/0!"},{"$error":"#DIV/0!"},{"$error":"#DIV/0!"},{"$error":"#DIV/0!"},{"$f":"IF(A230=\"m\",VLOOKUP(P230,Berechnung_Male!$A$1:$D$42,AA230,TRUE),VLOOKUP(Eingabeblatt!P230,Berechnung_Female!$A$1:$D$42,AA230,TRUE))","v":{"$error":"#DIV/0!"}},{"$error":"#DIV/0!"},null,null,null,{"$error":"#DIV/0!"}]
[null,null,null,null,null,null,null,0,null,null,null,0,0,0,{"$error":"#DIV/0!"},{"$error":"#DIV/0!"},{"$error":"#DIV/0!"},{"$error":"#DIV/0!"},{"$error":"#DIV/0!"},{"$error":"#DIV/0!"},{"$error":"#DIV/0!"},{"$f":"IF(A231=\"m\",VLOOKUP(P231,Berechnung_Male!$A$1:$D$42,AA231,TRUE),VLOOKUP(Eingabeblatt!P231,Berechnung_Female!$A$1:$D$42,AA231,TRUE))","v":{"$error":"#DIV/0!"}},{"$error":"#DIV/0!"},null,null,null,{"$error":"#DIV/0!"}]
[null,null,null,null,null,null,null,0,null,null,null,0,0,0,{"$error":"#DIV/0!"},{"$error":"#DIV/0!"},{"$error":"#DIV/0!"},{"$error":"#DIV/0!"},{"$error":"#DIV/0!"},{"$error":"#DIV/0!"},{"$error":"#DIV/0!"},{"$f":"IF(A232=\"m\",VLOOKUP(P232,Berechnung_Male!$A$1:$D$42,AA232,TRUE),VLOOKUP(Eingabeblatt!P232,Berechnung_Female!$A$1:$D$42,AA232,TRUE))","v":{"$error":"#DIV/0!"}},{"$error":"#DIV/0!"},null,null,null,{"$error":"#DIV/0!"}]
[null,null,null,null,null,null,null,0,null,null,null,0,0,0,{"$error":"#DIV/0!"},{"$error":"#DIV/0!"},{"$error":"#DIV/0!"},{"$error":"#DIV/0!"},{"$error":"#DIV/0!"},{"$error":"#DIV/0!"},{"$error":"#DIV/0!"},{"$f":"IF(A233=\"m\",VLOOKUP(P233,Berechnung_Male!$A$1:$D$42,AA233,TRUE),VLOOKUP(Eingabeblatt!P233,Berechnung_Female!$A$1:$D$42,AA233,TRUE))","v":{"$error":"#DIV/0!"}},{"$error":"#DIV/0!"},null,null,null,{"$error":"#DIV/0!"}]
[null,null,null,null,null,null,null,0,null,null,null,0,0,0,{"$error":"#DIV/0!"},{"$error":"#DIV/0!"},{"$error":"#DIV/0!"},{"$error":"#DIV/0!"},{"$error":"#DIV/0!"},{"$error":"#DIV/0!"},{"$error":"#DIV/0!"},{"$f":"IF(A234=\"m\",VLOOKUP(P234,Berechnung_Male!$A$1:$D$42,AA234,TRUE),VLOOKUP(Eingabeblatt!P234,Berechnung_Female!$A$1:$D$42,AA234,TRUE))","v":{"$error":"#DIV/0!"}},{"$error":"#DIV/0!"},null,null,null,{"$error":"#DIV/0!"}]
[null,null,null,null,null,null,null,0,null,null,null,0,0,0,{"$error":"#DIV/0!"},{"$error":"#DIV/0!"},{"$error":"#DIV/0!"},{"$error":"#DIV/0!"},{"$error":"#DIV/0!"},{"$error":"#DIV/0!"},{"$error":"#DIV/0!"},{"$f":"IF(A235=\"m\",VLOOKUP(P235,Berechnung_Male!$A$1:$D$42,AA235,TRUE),VLOOKUP(Eingabeblatt!P235,Berechnung_Female!$A$1:$D$42,AA235,TRUE))","v":{"$error":"#DIV/0!"}},{"$error":"#DIV/0!"},null,null,null,{"$error":"#DIV/0!"}]
[null,null,null,null,null,null,null,0,null,null,null,0,0,0,{"$error":"#DIV/0!"},{"$error":"#DIV/0!"},{"$error":"#DIV/0!"},{"$error":"#DIV/0!"},{"$error":"#DIV/0!"},{"$error":"#DIV/0!"},{"$error":"#DIV/0!"},{"$f":"IF(A236=\"m\",VLOOKUP(P236,Berechnung_Male!$A$1:$D$42,AA236,TRUE),VLOOKUP(Eingabeblatt!P236,Berechnung_Female!$A$1:$D$42,AA236,TRUE))","v":{"$error":"#DIV/0!"}},{"$error":"#DIV/0!"},null,null,null,{"$error":"#DIV/0!"}]
[null,null,null,null,null,null,null,0,null,null,null,0,0,0,{"$error":"#DIV/0!"},{"$error":"#DIV/0!"},{"$error":"#DIV/0!"},{"$error":"#DIV/0!"},{"$error":"#DIV/0!"},{"$error":"#DIV/0!"},{"$error":"#DIV/0!"},{"$f":"IF(A237=\"m\",VLOOKUP(P237,Berechnung_Male!$A$1:$D$42,AA237,TRUE),VLOOKUP(Eingabeblatt!P237,Berechnung_Female!$A$1:$D$42,AA237,TRUE))","v":{"$error":"#DIV/0!"}},{"$error":"#DIV/0!"},null,null,null,{"$error":"#DIV/0!"}]
[null,null,null,null,null,null,null,0,null,null,null,0,0,0,{"$error":"#DIV/0!"},{"$error":"#DIV/0!"},{"$error":"#DIV/0!"},{"$error":"#DIV/0!"},{"$error":"#DIV/0!"},{"$error":"#DIV/0!"},{"$error":"#DIV/0!"},{"$f":"IF(A238=\"m\",VLOOKUP(P238,Berechnung_Male!$A$1:$D$42,AA238,TRUE),VLOOKUP(Eingabeblatt!P238,Berechnung_Female!$A$1:$D$42,AA238,TRUE))","v":{"$error":"#DIV/0!"}},{"$error":"#DIV/0!"},null,null,null,{"$error":"#DIV/0!"}]
[null,null,null,null,null,null,null,0,null,null,null,0,0,0,{"$error":"#DIV/0!"},{"$error":"#DIV/0!"},{"$error":"#DIV/0!"},{"$error":"#DIV/0!"},{"$error":"#DIV/0!"},{"$error":"#DIV/0!"},{"$error":"#DIV/0!"},{"$f":"IF(A239=\"m\",VLOOKUP(P239,Berechnung_Male!$A$1:$D$42,AA239,TRUE),VLOOKUP(Eingabeblatt!P239,Berechnung_Female!$A$1:$D$42,AA239,TRUE))","v":{"$error":"#DIV/0!"}},{"$error":"#DIV/0!"},null,null,null,{"$error":"#DIV/0!"}]
[null,null,null,null,null,null,null,0,null,null,null,0,0,0,{"$error":"#DIV/0!"},{"$error":"#DIV/0!"},{"$error":"#DIV/0!"},{"$error":"#DIV/0!"},{"$error":"#DIV/0!"},{"$error":"#DIV/0!"},{"$error":"#DIV/0!"},{"$f":"IF(A240=\"m\",VLOOKUP(P240,Berechnung_Male!$A$1:$D$42,AA240,TRUE),VLOOKUP(Eingabeblatt!P240,Berechnung_Female!$A$1:$D$42,AA240,TRUE))","v":{"$error":"#DIV/0!"}},{"$error":"#DIV/0!"},null,null,null,{"$error":"#DIV/0!"}]
[null,null,null,null,null,null,null,0,null,null,null,0,0,0,{"$error":"#DIV/0!"},{"$error":"#DIV/0!"},{"$error":"#DIV/0!"},{"$error":"#DIV/0!"},{"$error":"#DIV/0!"},{"$error":"#DIV/0!"},{"$error":"#DIV/0!"},{"$f":"IF(A241=\"m\",VLOOKUP(P241,Berechnung_Male!$A$1:$D$42,AA241,TRUE),VLOOKUP(Eingabeblatt!P241,Berechnung_Female!$A$1:$D$42,AA241,TRUE))","v":{"$error":"#DIV/0!"}},{"$error":"#DIV/0!"},null,null,null,{"$error":"#DIV/0!"}]
[null,null,null,null,null,null,null,0,null,null,null,0,0,0,{"$error":"#DIV/0!"},{"$error":"#DIV/0!"},{"$error":"#DIV/0!"},{"$error":"#DIV/0!"},{"$error":"#DIV/0!"},{"$error":"#DIV/0!"},{"$error":"#DIV/0!"},{"$f":"IF(A242=\"m\",VLOOKUP(P242,Berechnung_Male!$A$1:$D$42,AA242,TRUE),VLOOKUP(Eingabeblatt!P242,Berechnung_Female!$A$1:$D$42,AA242,TRUE))","v":{"$error":"#DIV/0!"}},{"$error":"#DIV/0!"},null,null,null,{"$error":"#DIV/0!"}]
[null,null,null,null,null,null,null,0,null,null,null,0,0,0,{"$error":"#DIV/0!"},{"$error":"#DIV/0!"},{"$error":"#DIV/0!"},{"$error":"#DIV/0!"},{"$error":"#DIV/0!"},{"$error":"#DIV/0!"},{"$error":"#DIV/0!"},{"$f":"IF(A243=\"m\",VLOOKUP(P243,Berechnung_Male!$A$1:$D$42,AA243,TRUE),VLOOKUP(Eingabeblatt!P243,Berechnung_Female!$A$1:$D$42,AA243,TRUE))","v":{"$error":"#DIV/0!"}},{"$error":"#DIV/0!"},null,null,null,{"$error":"#DIV/0!"}]
[null,null,null,null,null,null,null,0,null,null,null,0,0,0,{"$error":"#DIV/0!"},{"$error":"#DIV/0!"},{"$error":"#DIV/0!"},{"$error":"#DIV/0!"},{"$error":"#DIV/0!"},{"$error":"#DIV/0!"},{"$error":"#DIV/0!"},{"$f":"IF(A244=\"m\",VLOOKUP(P244,Berechnung_Male!$A$1:$D$42,AA244,TRUE),VLOOKUP(Eingabeblatt!P244,Berechnung_Female!$A$1:$D$42,AA244,TRUE))","v":{"$error":"#DIV/0!"}},{"$error":"#DIV/0!"},null,null,null,{"$error":"#DIV/0!"}]
[null,null,null,null,null,null,null,0,null,null,null,0,0,0,{"$error":"#DIV/0!"},{"$error":"#DIV/0!"},{"$error":"#DIV/0!"},{"$error":"#DIV/0!"},{"$error":"#DIV/0!"},{"$error":"#DIV/0!"},{"$error":"#DIV/0!"},{"$f":"IF(A245=\"m\",VLOOKUP(P245,Berechnung_Male!$A$1:$D$42,AA245,TRUE),VLOOKUP(Eingabeblatt!P245,Berechnung_Female!$A$1:$D$42,AA245,TRUE))","v":{"$error":"#DIV/0!"}},{"$error":"#DIV/0!"},null,null,null,{"$error":"#DIV/0!"}]
[null,null,null,null,null,null,null,0,null,null,null,0,0,0,{"$error":"#DIV/0!"},{"$error":"#DIV/0!"},{"$error":"#DIV/0!"},{"$error":"#DIV/0!"},{"$error":"#DIV/0!"},{"$error":"#DIV/0!"},{"$error":"#DIV/0!"},{"$f":"IF(A246=\"m\",VLOOKUP(P246,Berechnung_Male!$A$1:$D$42,AA246,TRUE),VLOOKUP(Eingabeblatt!P246,Berechnung_Female!$A$1:$D$42,AA246,TRUE))","v":{"$error":"#DIV/0!"}},{"$error":"#DIV/0!"},null,null,null,{"$error":"#DIV/0!"}]
[null,null,null,null,null,null,null,0,null,null,null,0,0,0,{"$error":"#DIV/0!"},{"$error":"#DIV/0!"},{"$error":"#DIV/0!"},{"$error":"#DIV/0!"},{"$error":"#DIV/0!"},{"$error":"#DIV/0!"},{"$error":"#DIV/0!"},{"$f":"IF(A247=\"m\",VLOOKUP(P247,Berechnung_Male!$A$1:$D$42,AA247,TRUE),VLOOKUP(Eingabeblatt!P247,Berechnung_Female!$A$1:$D$42,AA247,TRUE))","v":{"$error":"#DIV/0!"}},{"$error":"#DIV/0!"},null,null,null,{"$error":"#DIV/0!"}]
[null,null,null,null,null,null,null,0,null,null,null,0,0,0,{"$error":"#DIV/0!"},{"$error":"#DIV/0!"},{"$error":"#DIV/0!"},{"$error":"#DIV/0!"},{"$error":"#DIV/0!"},{"$error":"#DIV/0!"},{"$error":"#DIV/0!"},{"$f":"IF(A248=\"m\",VLOOKUP(P248,Berechnung_Male!$A$1:$D$42,AA248,TRUE),VLOOKUP(Eingabeblatt!P248,Berechnung_Female!$A$1:$D$42,AA248,TRUE))","v":{"$error":"#DIV/0!"}},{"$error":"#DIV/0!"},null,null,null,{"$error":"#DIV/0!"}]
[null,null,null,null,null,null,null,0,null,null,null,0,0,0,{"$error":"#DIV/0!"},{"$error":"#DIV/0!"},{"$error":"#DIV/0!"},{"$error":"#DIV/0!"},{"$error":"#DIV/0!"},{"$error":"#DIV/0!"},{"$error":"#DIV/0!"},{"$f":"IF(A249=\"m\",VLOOKUP(P249,Berechnung_Male!$A$1:$D$42,AA249,TRUE),VLOOKUP(Eingabeblatt!P249,Berechnung_Female!$A$1:$D$42,AA249,TRUE))","v":{"$error":"#DIV/0!"}},{"$error":"#DIV/0!"},null,null,null,{"$error":"#DIV/0!"}]
[null,null,null,null,null,null,null,0,null,null,null,0,0,0,{"$error":"#DIV/0!"},{"$error":"#DIV/0!"},{"$error":"#DIV/0!"},{"$error":"#DIV/0!"},{"$error":"#DIV/0!"},{"$error":"#DIV/0!"},{"$error":"#DIV/0!"},{"$f":"IF(A250=\"m\",VLOOKUP(P250,Berechnung_Male!$A$1:$D$42,AA250,TRUE),VLOOKUP(Eingabeblatt!P250,Berechnung_Female!$A$1:$D$42,AA250,TRUE))","v":{"$error":"#DIV/0!"}},{"$error":"#DIV/0!"},null,null,null,{"$error":"#DIV/0!"}]
[null,null,null,null,null,null,null,0,null,null,null,0,0,0,{"$error":"#DIV/0!"},{"$error":"#DIV/0!"},{"$error":"#DIV/0!"},{"$error":"#DIV/0!"},{"$error":"#DIV/0!"},{"$error":"#DIV/0!"},{"$error":"#DIV/0!"},{"$f":"IF(A251=\"m\",VLOOKUP(P251,Berechnung_Male!$A$1:$D$42,AA251,TRUE),VLOOKUP(Eingabeblatt!P251,Berechnung_Female!$A$1:$D$42,AA251,TRUE))","v":{"$error":"#DIV/0!"}},{"$error":"#DIV/0!"},null,null,null,{"$error":"#DIV/0!"}]
[null,null,null,null,null,null,null,0,null,null,null,0,0,0,{"$error":"#DIV/0!"},{"$error":"#DIV/0!"},{"$error":"#DIV/0!"},{"$error":"#DIV/0!"},{"$error":"#DIV/0!"},{"$error":"#DIV/0!"},{"$error":"#DIV/0!"},{"$f":"IF(A252=\"m\",VLOOKUP(P252,Berechnung_Male!$A$1:$D$42,AA252,TRUE),VLOOKUP(Eingabeblatt!P252,Berechnung_Female!$A$1:$D$42,AA252,TRUE))","v":{"$error":"#DIV/0!"}},{"$error":"#DIV/0!"},null,null,null,{"$error":"#DIV/0!"}]
[null,null,null,null,null,null,null,0,null,null,null,0,0,0,{"$error":"#DIV/0!"},{"$error":"#DIV/0!"},{"$error":"#DIV/0!"},{"$error":"#DIV/0!"},{"$error":"#DIV/0!"},{"$error":"#DIV/0!"},{"$error":"#DIV/0!"},{"$f":"IF(A253=\"m\",VLOOKUP(P253,Berechnung_Male!$A$1:$D$42,AA253,TRUE),VLOOKUP(Eingabeblatt!P253,Berechnung_Female!$A$1:$D$42,AA253,TRUE))","v":{"$error":"#DIV/0!"}},{"$error":"#DIV/0!"},null,null,null,{"$error":"#DIV/0!"}]
[null,null,null,null,null,null,null,0,null,null,null,0,0,0,{"$error":"#DIV/0!"},{"$error":"#DIV/0!"},{"$error":"#DIV/0!"},{"$error":"#DIV/0!"},{"$error":"#DIV/0!"},{"$error":"#DIV/0!"},{"$error":"#DIV/0!"},{"$f":"IF(A254=\"m\",VLOOKUP(P254,Berechnung_Male!$A$1:$D$42,AA254,TRUE),VLOOKUP(Eingabeblatt!P254,Berechnung_Female!$A$1:$D$42,AA254,TRUE))","v":{"$error":"#DIV/0!"}},{"$error":"#DIV/0!"},null,null,null,{"$error":"#DIV/0!"}]
[null,null,null,null,null,null,null,0,null,null,null,0,0,0,{"$error":"#DIV/0!"},{"$error":"#DIV/0!"},{"$error":"#DIV/0!"},{"$error":"#DIV/0!"},{"$error":"#DIV/0!"},{"$error":"#DIV/0!"},{"$error":"#DIV/0!"},{"$f":"IF(A255=\"m\",VLOOKUP(P255,Berechnung_Male!$A$1:$D$42,AA255,TRUE),VLOOKUP(Eingabeblatt!P255,Berechnung_Female!$A$1:$D$42,AA255,TRUE))","v":{"$error":"#DIV/0!"}},{"$error":"#DIV/0!"},null,null,null,{"$error":"#DIV/0!"}]
[null,null,null,null,null,null,null,0,null,null,null,0,0,0,{"$error":"#DIV/0!"},{"$error":"#DIV/0!"},{"$error":"#DIV/0!"},{"$error":"#DIV/0!"},{"$error":"#DIV/0!"},{"$error":"#DIV/0!"},{"$error":"#DIV/0!"},{"$f":"IF(A256=\"m\",VLOOKUP(P256,Berechnung_Male!$A$1:$D$42,AA256,TRUE),VLOOKUP(Eingabeblatt!P256,Berechnung_Female!$A$1:$D$42,AA256,TRUE))","v":{"$error":"#DIV/0!"}},{"$error":"#DIV/0!"},null,null,null,{"$error":"#DIV/0!"}]
[null,null,null,null,null,null,null,0,null,null,null,0,0,0,{"$error":"#DIV/0!"},{"$error":"#DIV/0!"},{"$error":"#DIV/0!"},{"$error":"#DIV/0!"},{"$error":"#DIV/0!"},{"$error":"#DIV/0!"},{"$error":"#DIV/0!"},{"$f":"IF(A257=\"m\",VLOOKUP(P257,Berechnung_Male!$A$1:$D$42,AA257,TRUE),VLOOKUP(Eingabeblatt!P257,Berechnung_Female!$A$1:$D$42,AA257,TRUE))","v":{"$error":"#DIV/0!"}},{"$error":"#DIV/0!"},null,null,null,{"$error":"#DIV/0!"}]
[null,null,null,null,null,null,null,0,null,null,null,0,0,0,{"$error":"#DIV/0!"},{"$error":"#DIV/0!"},{"$error":"#DIV/0!"},{"$error":"#DIV/0!"},{"$error":"#DIV/0!"},{"$error":"#DIV/0!"},{"$error":"#DIV/0!"},{"$f":"IF(A258=\"m\",VLOOKUP(P258,Berechnung_Male!$A$1:$D$42,AA258,TRUE),VLOOKUP(Eingabeblatt!P258,Berechnung_Female!$A$1:$D$42,AA258,TRUE))","v":{"$error":"#DIV/0!"}},{"$error":"#DIV/0!"},null,null,null,{"$error":"#DIV/0!"}]
[null,null,null,null,null,null,null,0,null,null,null,0,0,0,{"$error":"#DIV/0!"},{"$error":"#DIV/0!"},{"$error":"#DIV/0!"},{"$error":"#DIV/0!"},{"$error":"#DIV/0!"},{"$error":"#DIV/0!"},{"$error":"#DIV/0!"},{"$f":"IF(A259=\"m\",VLOOKUP(P259,Berechnung_Male!$A$1:$D$42,AA259,TRUE),VLOOKUP(Eingabeblatt!P259,Berechnung_Female!$A$1:$D$42,AA259,TRUE))","v":{"$error":"#DIV/0!"}},{"$error":"#DIV/0!"},null,null,null,{"$error":"#DIV/0!"}]
[null,null,null,null,null,null,null,0,null,null,null,0,0,0,{"$error":"#DIV/0!"},{"$error":"#DIV/0!"},{"$error":"#DIV/0!"},{"$error":"#DIV/0!"},{"$error":"#DIV/0!"},{"$error":"#DIV/0!"},{"$error":"#DIV/0!"},{"$f":"IF(A260=\"m\",VLOOKUP(P260,Berechnung_Male!$A$1:$D$42,AA260,TRUE),VLOOKUP(Eingabeblatt!P260,Berechnung_Female!$A$1:$D$42,AA260,TRUE))","v":{"$error":"#DIV/0!"}},{"$error":"#DIV/0!"},null,null,null,{"$error":"#DIV/0!"}]
[null,null,null,null,null,null,null,0,null,null,null,0,0,0,{"$error":"#DIV/0!"},{"$error":"#DIV/0!"},{"$error":"#DIV/0!"},{"$error":"#DIV/0!"},{"$f":"IF(A261=\"m\",(IF(O261<12.8,1,IF(O261<13.3,2,IF(O261>14.8,5,IF(O261>14.3,4,3))))),(IF(O261<11,1,IF(O261<11.5,2,IF(O261>13,5,IF(O261>12.5,4,3))))))","v":{"$error":"#DIV/0!"}},{"$error":"#DIV/0!"},{"$error":"#DIV/0!"},{"$f":"IF(A261=\"m\",VLOOKUP(P261,Berechnung_Male!$A$1:$D$42,AA261,TRUE),VLOOKUP(Eingabeblatt!P261,Berechnung_Female!$A$1:$D$42,AA261,TRUE))","v":{"$error":"#DIV/0!"}},{"$error":"#DIV/0!"},null,null,null,{"$f":"IF(A261=\"m\",IF(O261<12.8,2,IF(O261<14.8,3,4)),IF(O261<11,2,IF(O261<13,3,4)))","v":{"$error":"#DIV/0!"}}]
[null,null,null,null,null,null,null,{"$f":"F262-G262","v":0},null,null,null,{"$f":"J262-K262","v":0},{"$f":"I262-L262","v":0},{"$f":"(B262-E262)/365.25","v":0},{"$f":"N262-P262","v":{"$error":"#DIV/0!"}},{"$f":"IF(A262=\"m\",(-9.236+(0.0002708*M262*L262)+(-0.001663*N262*M262)+(0.007216*N262*L262)+(0.02292*H262/I262*100)),(-9.376+(0.0001882*M262*L262)+(0.0022*N262*M262)+(0.005841*N262*L262)-(0.002658*N262*H262)+(0.07693*(H262/I262)*100)))","v":{"$error":"#DIV/0!"}},{"$f":"IF(R262=1,\"Früh / précoce\",IF(R262=2,\"Durchschnittlich / Normal\",\"Spät / Tardif\"))","v":{"$error":"#DIV/0!"}},{"$f":"IF(A262=\"m\",(IF(O262<12.8,1,IF(O262>14.8,3,2))),(IF(O262<11,1,IF(O262>13,3,2))))","v":{"$error":"#DIV/0!"}},{"$error":"#DIV/0!"},{"$f":"IF(S262=1,\"Früh / précoce\",IF(S262=2,\"Möglicherweise Früh / éventuellement précoce\", IF(S262=3,\"Durchschnittlich / Normal\",IF(S262=4,\"Möglicherweise spät / éventuellement tardif\",\"Spät / Tardif\"))))","v":{"$error":"#DIV/0!"}},{"$f":"I262+V262","v":{"$error":"#DIV/0!"}},{"$f":"IF(A262=\"m\",VLOOKUP(P262,Berechnung_Male!$A$1:$D$42,AA262,TRUE),VLOOKUP(Eingabeblatt!P262,Berechnung_Female!$A$1:$D$42,AA262,TRUE))","v":{"$error":"#DIV/0!"}},{"$f":"I262/U262","v":{"$error":"#DIV/0!"}},null,null,null,{"$error":"#DIV/0!"}]
[null,null,null,null,null,null,null,0,null,null,null,0,0,0,{"$error":"#DIV/0!"},{"$error":"#DIV/0!"},{"$error":"#DIV/0!"},{"$error":"#DIV/0!"},{"$error":"#DIV/0!"},{"$error":"#DIV/0!"},{"$error":"#DIV/0!"},{"$f":"IF(A263=\"m\",VLOOKUP(P263,Berechnung_Male!$A$1:$D$42,AA263,TRUE),VLOOKUP(Eingabeblatt!P263,Berechnung_Female!$A$1:$D$42,AA263,TRUE))","v":{"$error":"#DIV/0!"}},{"$error":"#DIV/0!"},null,null,null,{"$error":"#DIV/0!"}]
[null,null,null,null,null,null,null,0,null,null,null,0,0,0,{"$error":"#DIV/0!"},{"$error":"#DIV/0!"},{"$error":"#DIV/0!"},{"$error":"#DIV/0!"},{"$error":"#DIV/0!"},{"$error":"#DIV/0!"},{"$error":"#DIV/0!"},{"$f":"IF(A264=\"m\",VLOOKUP(P264,Berechnung_Male!$A$1:$D$42,AA264,TRUE),VLOOKUP(Eingabeblatt!P264,Berechnung_Female!$A$1:$D$42,AA264,TRUE))","v":{"$error":"#DIV/0!"}},{"$error":"#DIV/0!"},null,null,null,{"$error":"#DIV/0!"}]
[null,null,null,null,null,null,null,0,null,null,null,0,0,0,{"$error":"#DIV/0!"},{"$error":"#DIV/0!"},{"$error":"#DIV/0!"},{"$error":"#DIV/0!"},{"$error":"#DIV/0!"},{"$error":"#DIV/0!"},{"$error":"#DIV/0!"},{"$f":"IF(A265=\"m\",VLOOKUP(P265,Berechnung_Male!$A$1:$D$42,AA265,TRUE),VLOOKUP(Eingabeblatt!P265,Berechnung_Female!$A$1:$D$42,AA265,TRUE))","v":{"$error":"#DIV/0!"}},{"$error":"#DIV/0!"},null,null,null,{"$error":"#DIV/0!"}]
[null,null,null,null,null,null,null,0,null,null,null,0,0,0,{"$error":"#DIV/0!"},{"$error":"#DIV/0!"},{"$error":"#DIV/0!"},{"$error":"#DIV/0!"},{"$error":"#DIV/0!"},{"$error":"#DIV/0!"},{"$error":"#DIV/0!"},{"$f":"IF(A266=\"m\",VLOOKUP(P266,Berechnung_Male!$A$1:$D$42,AA266,TRUE),VLOOKUP(Eingabeblatt!P266,Berechnung_Female!$A$1:$D$42,AA266,TRUE))","v":{"$error":"#DIV/0!"}},{"$error":"#DIV/0!"},null,null,null,{"$error":"#DIV/0!"}]
[null,null,null,null,null,null,null,0,null,null,null,0,0,0,{"$error":"#DIV/0!"},{"$error":"#DIV/0!"},{"$error":"#DIV/0!"},{"$error":"#DIV/0!"},{"$error":"#DIV/0!"},{"$error":"#DIV/0!"},{"$error":"#DIV/0!"},{"$f":"IF(A267=\"m\",VLOOKUP(P267,Berechnung_Male!$A$1:$D$42,AA267,TRUE),VLOOKUP(Eingabeblatt!P267,Berechnung_Female!$A$1:$D$42,AA267,TRUE))","v":{"$error":"#DIV/0!"}},{"$error":"#DIV/0!"},null,null,null,{"$error":"#DIV/0!"}]
[null,null,null,null,null,null,null,0,null,null,null,0,0,0,{"$error":"#DIV/0!"},{"$error":"#DIV/0!"},{"$error":"#DIV/0!"},{"$error":"#DIV/0!"},{"$error":"#DIV/0!"},{"$error":"#DIV/0!"},{"$error":"#DIV/0!"},{"$f":"IF(A268=\"m\",VLOOKUP(P268,Berechnung_Male!$A$1:$D$42,AA268,TRUE),VLOOKUP(Eingabeblatt!P268,Berechnung_Female!$A$1:$D$42,AA268,TRUE))","v":{"$error":"#DIV/0!"}},{"$error":"#DIV/0!"},null,null,null,{"$error":"#DIV/0!"}]
[null,null,null,null,null,null,null,0,null,null,null,0,0,0,{"$error":"#DIV/0!"},{"$error":"#DIV/0!"},{"$error":"#DIV/0!"},{"$error":"#DIV/0!"},{"$error":"#DIV/0!"},{"$error":"#DIV/0!"},{"$error":"#DIV/0!"},{"$f":"IF(A269=\"m\",VLOOKUP(P269,Berechnung_Male!$A$1:$D$42,AA269,TRUE),VLOOKUP(Eingabeblatt!P269,Berechnung_Female!$A$1:$D$42,AA269,TRUE))","v":{"$error":"#DIV/0!"}},{"$error":"#DIV/0!"},null,null,null,{"$error":"#DIV/0!"}]
[null,null,null,null,null,null,null,0,null,null,null,0,0,0,{"$error":"#DIV/0!"},{"$error":"#DIV/0!"},{"$error":"#DIV/0!"},{"$error":"#DIV/0!"},{"$error":"#DIV/0!"},{"$error":"#DIV/0!"},{"$error":"#DIV/0!"},{"$f":"IF(A270=\"m\",VLOOKUP(P270,Berechnung_Male!$A$1:$D$42,AA270,TRUE),VLOOKUP(Eingabeblatt!P270,Berechnung_Female!$A$1:$D$42,AA270,TRUE))","v":{"$error":"#DIV/0!"}},{"$error":"#DIV/0!"},null,null,null,{"$error":"#DIV/0!"}]
[null,null,null,null,null,null,null,0,null,null,null,0,0,0,{"$error":"#DIV/0!"},{"$error":"#DIV/0!"},{"$error":"#DIV/0!"},{"$error":"#DIV/0!"},{"$error":"#DIV/0!"},{"$error":"#DIV/0!"},{"$error":"#DIV/0!"},{"$f":"IF(A271=\"m\",VLOOKUP(P271,Berechnung_Male!$A$1:$D$42,AA271,TRUE),VLOOKUP(Eingabeblatt!P271,Berechnung_Female!$A$1:$D$42,AA271,TRUE))","v":{"$error":"#DIV/0!"}},{"$error":"#DIV/0!"},null,null,null,{"$error":"#DIV/0!"}]
[null,null,null,null,null,null,null,0,null,null,null,0,0,0,{"$error":"#DIV/0!"},{"$error":"#DIV/0!"},{"$error":"#DIV/0!"},{"$error":"#DIV/0!"},{"$error":"#DIV/0!"},{"$error":"#DIV/0!"},{"$error":"#DIV/0!"},{"$f":"IF(A272=\"m\",VLOOKUP(P272,Berechnung_Male!$A$1:$D$42,AA272,TRUE),VLOOKUP(Eingabeblatt!P272,Berechnung_Female!$A$1:$D$42,AA272,TRUE))","v":{"$error":"#DIV/0!"}},{"$error":"#DIV/0!"},null,null,null,{"$error":"#DIV/0!"}]
[null,null,null,null,null,null,null,0,null,null,null,0,0,0,{"$error":"#DIV/0!"},{"$error":"#DIV/0!"},{"$error":"#DIV/0!"},{"$error":"#DIV/0!"},{"$error":"#DIV/0!"},{"$error":"#DIV/0!"},{"$error":"#DIV/0!"},{"$f":"IF(A273=\"m\",VLOOKUP(P273,Berechnung_Male!$A$1:$D$42,AA273,TRUE),VLOOKUP(Eingabeblatt!P273,Berechnung_Female!$A$1:$D$42,AA273,TRUE))","v":{"$error":"#DIV/0!"}},{"$error":"#DIV/0!"},null,null,null,{"$error":"#DIV/0!"}]
[null,null,null,null,null,null,null,0,null,null,null,0,0,0,{"$error":"#DIV/0!"},{"$error":"#DIV/0!"},{"$error":"#DIV/0!"},{"$error":"#DIV/0!"},{"$error":"#DIV/0!"},{"$error":"#DIV/0!"},{"$error":"#DIV/0!"},{"$f":"IF(A274=\"m\",VLOOKUP(P274,Berechnung_Male!$A$1:$D$42,AA274,TRUE),VLOOKUP(Eingabeblatt!P274,Berechnung_Female!$A$1:$D$42,AA274,TRUE))","v":{"$error":"#DIV/0!"}},{"$error":"#DIV/0!"},null,null,null,{"$error":"#DIV/0!"}]
[null,null,null,null,null,null,null,0,null,null,null,0,0,0,{"$error":"#DIV/0!"},{"$error":"#DIV/0!"},{"$error":"#DIV/0!"},{"$error":"#DIV/0!"},{"$error":"#DIV/0!"},{"$error":"#DIV/0!"},{"$error":"#DIV/0!"},{"$f":"IF(A275=\"m\",VLOOKUP(P275,Berechnung_Male!$A$1:$D$42,AA275,TRUE),VLOOKUP(Eingabeblatt!P275,Berechnung_Female!$A$1:$D$42,AA275,TRUE))","v":{"$error":"#DIV/0!"}},{"$error":"#DIV/0!"},null,null,null,{"$error":"#DIV/0!"}]
[null,null,null,null,null,null,null,0,null,null,null,0,0,0,{"$error":"#DIV/0!"},{"$error":"#DIV/0!"},{"$error":"#DIV/0!"},{"$error":"#DIV/0!"},{"$error":"#DIV/0!"},{"$error":"#DIV/0!"},{"$error":"#DIV/0!"},{"$f":"IF(A276=\"m\",VLOOKUP(P276,Berechnung_Male!$A$1:$D$42,AA276,TRUE),VLOOKUP(Eingabeblatt!P276,Berechnung_Female!$A$1:$D$42,AA276,TRUE))","v":{"$error":"#DIV/0!"}},{"$error":"#DIV/0!"},null,null,null,{"$error":"#DIV/0!"}]
[null,null,null,null,null,null,null,0,null,null,null,0,0,0,{"$error":"#DIV/0!"},{"$error":"#DIV/0!"},{"$error":"#DIV/0!"},{"$error":"#DIV/0!"},{"$error":"#DIV/0!"},{"$error":"#DIV/0!"},{"$error":"#DIV/0!"},{"$f":"IF(A277=\"m\",VLOOKUP(P277,Berechnung_Male!$A$1:$D$42,AA277,TRUE),VLOOKUP(Eingabeblatt!P277,Berechnung_Female!$A$1:$D$42,AA277,TRUE))","v":{"$error":"#DIV/0!"}},{"$error":"#DIV/0!"},null,null,null,{"$error":"#DIV/0!"}]
[null,null,null,null,null,null,null,0,null,null,null,0,0,0,{"$error":"#DIV/0!"},{"$error":"#DIV/0!"},{"$error":"#DIV/0!"},{"$error":"#DIV/0!"},{"$error":"#DIV/0!"},{"$error":"#DIV/0!"},{"$error":"#DIV/0!"},{"$f":"IF(A278=\"m\",VLOOKUP(P278,Berechnung_Male!$A$1:$D$42,AA278,TRUE),VLOOKUP(Eingabeblatt!P278,Berechnung_Female!$A$1:$D$42,AA278,TRUE))","v":{"$error":"#DIV/0!"}},{"$error":"#DIV/0!"},null,null,null,{"$error":"#DIV/0!"}]
[null,null,null,null,null,null,null,0,null,null,null,0,0,0,{"$error":"#DIV/0!"},{"$error":"#DIV/0!"},{"$error":"#DIV/0!"},{"$error":"#DIV/0!"},{"$error":"#DIV/0!"},{"$error":"#DIV/0!"},{"$error":"#DIV/0!"},{"$f":"IF(A279=\"m\",VLOOKUP(P279,Berechnung_Male!$A$1:$D$42,AA279,TRUE),VLOOKUP(Eingabeblatt!P279,Berechnung_Female!$A$1:$D$42,AA279,TRUE))","v":{"$error":"#DIV/0!"}},{"$error":"#DIV/0!"},null,null,null,{"$error":"#DIV/0!"}]
[null,null,null,null,null,null,null,0,null,null,null,0,0,0,{"$error":"#DIV/0!"},{"$error":"#DIV/0!"},{"$error":"#DIV/0!"},{"$error":"#DIV/0!"},{"$error":"#DIV/0!"},{"$error":"#DIV/0!"},{"$error":"#DIV/0!"},{"$f":"IF(A280=\"m\",VLOOKUP(P280,Berechnung_Male!$A$1:$D$42,AA280,TRUE),VLOOKUP(Eingabeblatt!P280,Berechnung_Female!$A$1:$D$42,AA280,TRUE))","v":{"$error":"#DIV/0!"}},{"$error":"#DIV/0!"},null,null,null,{"$error":"#DIV/0!"}]
[null,null,null,null,null,null,null,0,null,null,null,0,0,0,{"$error":"#DIV/0!"},{"$error":"#DIV/0!"},{"$error":"#DIV/0!"},{"$error":"#DIV/0!"},{"$error":"#DIV/0!"},{"$error":"#DIV/0!"},{"$error":"#DIV/0!"},{"$f":"IF(A281=\"m\",VLOOKUP(P281,Berechnung_Male!$A$1:$D$42,AA281,TRUE),VLOOKUP(Eingabeblatt!P281,Berechnung_Female!$A$1:$D$42,AA281,TRUE))","v":{"$error":"#DIV/0!"}},{"$error":"#DIV/0!"},null,null,null,{"$error":"#DIV/0!"}]
[null,null,null,null,null,null,null,0,null,null,null,0,0,0,{"$error":"#DIV/0!"},{"$error":"#DIV/0!"},{"$error":"#DIV/0!"},{"$error":"#DIV/0!"},{"$error":"#DIV/0!"},{"$error":"#DIV/0!"},{"$error":"#DIV/0!"},{"$f":"IF(A282=\"m\",VLOOKUP(P282,Berechnung_Male!$A$1:$D$42,AA282,TRUE),VLOOKUP(Eingabeblatt!P282,Berechnung_Female!$A$1:$D$42,AA282,TRUE))","v":{"$error":"#DIV/0!"}},{"$error":"#DIV/0!"},null,null,null,{"$error":"#DIV/0!"}]
[null,null,null,null,null,null,null,0,null,null,null,0,0,0,{"$error":"#DIV/0!"},{"$error":"#DIV/0!"},{"$error":"#DIV/0!"},{"$error":"#DIV/0!"},{"$error":"#DIV/0!"},{"$error":"#DIV/0!"},{"$error":"#DIV/0!"},{"$f":"IF(A283=\"m\",VLOOKUP(P283,Berechnung_Male!$A$1:$D$42,AA283,TRUE),VLOOKUP(Eingabeblatt!P283,Berechnung_Female!$A$1:$D$42,AA283,TRUE))","v":{"$error":"#DIV/0!"}},{"$error":"#DIV/0!"},null,null,null,{"$error":"#DIV/0!"}]
[null,null,null,null,null,null,null,0,null,null,null,0,0,0,{"$error":"#DIV/0!"},{"$error":"#DIV/0!"},{"$error":"#DIV/0!"},{"$error":"#DIV/0!"},{"$error":"#DIV/0!"},{"$error":"#DIV/0!"},{"$error":"#DIV/0!"},{"$f":"IF(A284=\"m\",VLOOKUP(P284,Berechnung_Male!$A$1:$D$42,AA284,TRUE),VLOOKUP(Eingabeblatt!P284,Berechnung_Female!$A$1:$D$42,AA284,TRUE))","v":{"$error":"#DIV/0!"}},{"$error":"#DIV/0!"},null,null,null,{"$error":"#DIV/0!"}]
[null,null,null,null,null,null,null,0,null,null,null,0,0,0,{"$error":"#DIV/0!"},{"$error":"#DIV/0!"},{"$error":"#DIV/0!"},{"$error":"#DIV/0!"},{"$error":"#DIV/0!"},{"$error":"#DIV/0!"},{"$error":"#DIV/0!"},{"$f":"IF(A285=\"m\",VLOOKUP(P285,Berechnung_Male!$A$1:$D$42,AA285,TRUE),VLOOKUP(Eingabeblatt!P285,Berechnung_Female!$A$1:$D$42,AA285,TRUE))","v":{"$error":"#DIV/0!"}},{"$error":"#DIV/0!"},null,null,null,{"$error":"#DIV/0!"}]
[null,null,null,null,null,null,null,0,null,null,null,0,0,0,{"$error":"#DIV/0!"},{"$error":"#DIV/0!"},{"$error":"#DIV/0!"},{"$error":"#DIV/0!"},{"$error":"#DIV/0!"},{"$error":"#DIV/0!"},{"$error":"#DIV/0!"},{"$f":"IF(A286=\"m\",VLOOKUP(P286,Berechnung_Male!$A$1:$D$42,AA286,TRUE),VLOOKUP(Eingabeblatt!P286,Berechnung_Female!$A$1:$D$42,AA286,TRUE))","v":{"$error":"#DIV/0!"}},{"$error":"#DIV/0!"},null,null,null,{"$error":"#DIV/0!"}]
[null,null,null,null,null,null,null,0,null,null,null,0,0,0,{"$error":"#DIV/0!"},{"$error":"#DIV/0!"},{"$error":"#DIV/0!"},{"$error":"#DIV/0!"},{"$error":"#DIV/0!"},{"$error":"#DIV/0!"},{"$error":"#DIV/0!"},{"$f":"IF(A287=\"m\",VLOOKUP(P287,Berechnung_Male!$A$1:$D$42,AA287,TRUE),VLOOKUP(Eingabeblatt!P287,Berechnung_Female!$A$1:$D$42,AA287,TRUE))","v":{"$error":"#DIV/0!"}},{"$error":"#DIV/0!"},null,null,null,{"$error":"#DIV/0!"}]
[null,null,null,null,null,null,null,0,null,null,null,0,0,0,{"$error":"#DIV/0!"},{"$error":"#DIV/0!"},{"$error":"#DIV/0!"},{"$error":"#DIV/0!"},{"$error":"#DIV/0!"},{"$error":"#DIV/0!"},{"$error":"#DIV/0!"},{"$f":"IF(A288=\"m\",VLOOKUP(P288,Berechnung_Male!$A$1:$D$42,AA288,TRUE),VLOOKUP(Eingabeblatt!P288,Berechnung_Female!$A$1:$D$42,AA288,TRUE))","v":{"$error":"#DIV/0!"}},{"$error":"#DIV/0!"},null,null,null,{"$error":"#DIV/0!"}]
[null,null,null,null,null,null,null,0,null,null,null,0,0,0,{"$error":"#DIV/0!"},{"$error":"#DIV/0!"},{"$error":"#DIV/0!"},{"$error":"#DIV/0!"},{"$error":"#DIV/0!"},{"$error":"#DIV/0!"},{"$error":"#DIV/0!"},{"$f":"IF(A289=\"m\",VLOOKUP(P289,Berechnung_Male!$A$1:$D$42,AA289,TRUE),VLOOKUP(Eingabeblatt!P289,Berechnung_Female!$A$1:$D$42,AA289,TRUE))","v":{"$error":"#DIV/0!"}},{"$error":"#DIV/0!"},null,null,null,{"$error":"#DIV/0!"}]
[null,null,null,null,null,null,null,0,null,null,null,0,0,0,{"$error":"#DIV/0!"},{"$error":"#DIV/0!"},{"$error":"#DIV/0!"},{"$error":"#DIV/0!"},{"$error":"#DIV/0!"},{"$error":"#DIV/0!"},{"$error":"#DIV/0!"},{"$f":"IF(A290=\"m\",VLOOKUP(P290,Berechnung_Male!$A$1:$D$42,AA290,TRUE),VLOOKUP(Eingabeblatt!P290,Berechnung_Female!$A$1:$D$42,AA290,TRUE))","v":{"$error":"#DIV/0!"}},{"$error":"#DIV/0!"},null,null,null,{"$error":"#DIV/0!"}]
[null,null,null,null,null,null,null,0,null,null,null,0,0,0,{"$error":"#DIV/0!"},{"$error":"#DIV/0!"},{"$error":"#DIV/0!"},{"$error":"#DIV/0!"},{"$error":"#DIV/0!"},{"$error":"#DIV/0!"},{"$error":"#DIV/0!"},{"$f":"IF(A291=\"m\",VLOOKUP(P291,Berechnung_Male!$A$1:$D$42,AA291,TRUE),VLOOKUP(Eingabeblatt!P291,Berechnung_Female!$A$1:$D$42,AA291,TRUE))","v":{"$error":"#DIV/0!"}},{"$error":"#DIV/0!"},null,null,null,{"$error":"#DIV/0!"}]
[null,null,null,null,null,null,null,0,null,null,null,0,0,0,{"$error":"#DIV/0!"},{"$error":"#DIV/0!"},{"$error":"#DIV/0!"},{"$error":"#DIV/0!"},{"$error":"#DIV/0!"},{"$error":"#DIV/0!"},{"$error":"#DIV/0!"},{"$f":"IF(A292=\"m\",VLOOKUP(P292,Berechnung_Male!$A$1:$D$42,AA292,TRUE),VLOOKUP(Eingabeblatt!P292,Berechnung_Female!$A$1:$D$42,AA292,TRUE))","v":{"$error":"#DIV/0!"}},{"$error":"#DIV/0!"},null,null,null,{"$error":"#DIV/0!"}]
[null,null,null,null,null,null,null,0,null,null,null,0,0,0,{"$error":"#DIV/0!"},{"$error":"#DIV/0!"},{"$error":"#DIV/0!"},{"$error":"#DIV/0!"},{"$error":"#DIV/0!"},{"$error":"#DIV/0!"},{"$error":"#DIV/0!"},{"$f":"IF(A293=\"m\",VLOOKUP(P293,Berechnung_Male!$A$1:$D$42,AA293,TRUE),VLOOKUP(Eingabeblatt!P293,Berechnung_Female!$A$1:$D$42,AA293,TRUE))","v":{"$error":"#DIV/0!"}},{"$error":"#DIV/0!"},null,null,null,{"$error":"#DIV/0!"}]
[null,null,null,null,null,null,null,0,null,null,null,0,0,0,{"$error":"#DIV/0!"},{"$error":"#DIV/0!"},{"$error":"#DIV/0!"},{"$error":"#DIV/0!"},{"$error":"#DIV/0!"},{"$error":"#DIV/0!"},{"$error":"#DIV/0!"},{"$f":"IF(A294=\"m\",VLOOKUP(P294,Berechnung_Male!$A$1:$D$42,AA294,TRUE),VLOOKUP(Eingabeblatt!P294,Berechnung_Female!$A$1:$D$42,AA294,TRUE))","v":{"$error":"#DIV/0!"}},{"$error":"#DIV/0!"},null,null,null,{"$error":"#DIV/0!"}]
[null,null,null,null,null,null,null,0,null,null,null,0,0,0,{"$error":"#DIV/0!"},{"$error":"#DIV/0!"},{"$error":"#DIV/0!"},{"$error":"#DIV/0!"},{"$error":"#DIV/0!"},{"$error":"#DIV/0!"},{"$error":"#DIV/0!"},{"$f":"IF(A295=\"m\",VLOOKUP(P295,Berechnung_Male!$A$1:$D$42,AA295,TRUE),VLOOKUP(Eingabeblatt!P295,Berechnung_Female!$A$1:$D$42,AA295,TRUE))","v":{"$error":"#DIV/0!"}},{"$error":"#DIV/0!"},null,null,null,{"$error":"#DIV/0!"}]
[null,null,null,null,null,null,null,0,null,null,null,0,0,0,{"$error":"#DIV/0!"},{"$error":"#DIV/0!"},{"$error":"#DIV/0!"},{"$error":"#DIV/0!"},{"$error":"#DIV/0!"},{"$error":"#DIV/0!"},{"$error":"#DIV/0!"},{"$f":"IF(A296=\"m\",VLOOKUP(P296,Berechnung_Male!$A$1:$D$42,AA296,TRUE),VLOOKUP(Eingabeblatt!P296,Berechnung_Female!$A$1:$D$42,AA296,TRUE))","v":{"$error":"#DIV/0!"}},{"$error":"#DIV/0!"},null,null,null,{"$error":"#DIV/0!"}]
[null,null,null,null,null,null,null,0,null,null,null,0,0,0,{"$error":"#DIV/0!"},{"$error":"#DIV/0!"},{"$error":"#DIV/0!"},{"$error":"#DIV/0!"},{"$error":"#DIV/0!"},{"$error":"#DIV/0!"},{"$error":"#DIV/0!"},{"$f":"IF(A297=\"m\",VLOOKUP(P297,Berechnung_Male!$A$1:$D$42,AA297,TRUE),VLOOKUP(Eingabeblatt!P297,Berechnung_Female!$A$1:$D$42,AA297,TRUE))","v":{"$error":"#DIV/0!"}},{"$error":"#DIV/0!"},null,null,null,{"$error":"#DIV/0!"}]
[null,null,null,null,null,null,null,0,null,null,null,0,0,0,{"$error":"#DIV/0!"},{"$error":"#DIV/0!"},{"$error":"#DIV/0!"},{"$error":"#DIV/0!"},{"$error":"#DIV/0!"},{"$error":"#DIV/0!"},{"$error":"#DIV/0!"},{"$f":"IF(A298=\"m\",VLOOKUP(P298,Berechnung_Male!$A$1:$D$42,AA298,TRUE),VLOOKUP(Eingabeblatt!P298,Berechnung_Female!$A$1:$D$42,AA298,TRUE))","v":{"$error":"#DIV/0!"}},{"$error":"#DIV/0!"},null,null,null,{"$error":"#DIV/0!"}]
[null,null,null,null,null,null,null,0,null,null,null,0,0,0,{"$error":"#DIV/0!"},{"$error":"#DIV/0!"},{"$error":"#DIV/0!"},{"$error":"#DIV/0!"},{"$error":"#DIV/0!"},{"$error":"#DIV/0!"},{"$error":"#DIV/0!"},{"$f":"IF(A299=\"m\",VLOOKUP(P299,Berechnung_Male!$A$1:$D$42,AA299,TRUE),VLOOKUP(Eingabeblatt!P299,Berechnung_Female!$A$1:$D$42,AA299,TRUE))","v":{"$error":"#DIV/0!"}},{"$error":"#DIV/0!"},null,null,null,{"$error":"#DIV/0!"}]
[null,null,null,null,null,null,null,0,null,null,null,0,0,0,{"$error":"#DIV/0!"},{"$error":"#DIV/0!"},{"$error":"#DIV/0!"},{"$error":"#DIV/0!"},{"$error":"#DIV/0!"},{"$error":"#DIV/0!"},{"$error":"#DIV/0!"},{"$f":"IF(A300=\"m\",VLOOKUP(P300,Berechnung_Male!$A$1:$D$42,AA300,TRUE),VLOOKUP(Eingabeblatt!P300,Berechnung_Female!$A$1:$D$42,AA300,TRUE))","v":{"$error":"#DIV/0!"}},{"$error":"#DIV/0!"},null,null,null,{"$error":"#DIV/0!"}]
[null,null,null,null,null,null,null,0,null,null,null,0,0,0,{"$error":"#DIV/0!"},{"$error":"#DIV/0!"},{"$error":"#DIV/0!"},{"$error":"#DIV/0!"},{"$error":"#DIV/0!"},{"$error":"#DIV/0!"},{"$error":"#DIV/0!"},{"$f":"IF(A301=\"m\",VLOOKUP(P301,Berechnung_Male!$A$1:$D$42,AA301,TRUE),VLOOKUP(Eingabeblatt!P301,Berechnung_Female!$A$1:$D$42,AA301,TRUE))","v":{"$error":"#DIV/0!"}},{"$error":"#DIV/0!"},null,null,null,{"$error":"#DIV/0!"}]
[null,null,null,null,null,null,null,0,null,null,null,0,0,0,{"$error":"#DIV/0!"},{"$error":"#DIV/0!"},{"$error":"#DIV/0!"},{"$error":"#DIV/0!"},{"$error":"#DIV/0!"},{"$error":"#DIV/0!"},{"$error":"#DIV/0!"},{"$f":"IF(A302=\"m\",VLOOKUP(P302,Berechnung_Male!$A$1:$D$42,AA302,TRUE),VLOOKUP(Eingabeblatt!P302,Berechnung_Female!$A$1:$D$42,AA302,TRUE))","v":{"$error":"#DIV/0!"}},{"$error":"#DIV/0!"},null,null,null,{"$error":"#DIV/0!"}]
[null,null,null,null,null,null,null,0,null,null,null,0,0,0,{"$error":"#DIV/0!"},{"$error":"#DIV/0!"},{"$error":"#DIV/0!"},{"$error":"#DIV/0!"},{"$error":"#DIV/0!"},{"$error":"#DIV/0!"},{"$error":"#DIV/0!"},{"$f":"IF(A303=\"m\",VLOOKUP(P303,Berechnung_Male!$A$1:$D$42,AA303,TRUE),VLOOKUP(Eingabeblatt!P303,Berechnung_Female!$A$1:$D$42,AA303,TRUE))","v":{"$error":"#DIV/0!"}},{"$error":"#DIV/0!"},null,null,null,{"$error":"#DIV/0!"}]
[null,null,null,null,null,null,null,0,null,null,null,0,0,0,{"$error":"#DIV/0!"},{"$error":"#DIV/0!"},{"$error":"#DIV/0!"},{"$error":"#DIV/0!"},{"$error":"#DIV/0!"},{"$error":"#DIV/0!"},{"$error":"#DIV/0!"},{"$f":"IF(A304=\"m\",VLOOKUP(P304,Berechnung_Male!$A$1:$D$42,AA304,TRUE),VLOOKUP(Eingabeblatt!P304,Berechnung_Female!$A$1:$D$42,AA304,TRUE))","v":{"$error":"#DIV/0!"}},{"$error":"#DIV/0!"},null,null,null,{"$error":"#DIV/0!"}]
[null,null,null,null,null,null,null,0,null,null,null,0,0,0,{"$error":"#DIV/0!"},{"$error":"#DIV/0!"},{"$error":"#DIV/0!"},{"$error":"#DIV/0!"},{"$error":"#DIV/0!"},{"$error":"#DIV/0!"},{"$error":"#DIV/0!"},{"$f":"IF(A305=\"m\",VLOOKUP(P305,Berechnung_Male!$A$1:$D$42,AA305,TRUE),VLOOKUP(Eingabeblatt!P305,Berechnung_Female!$A$1:$D$42,AA305,TRUE))","v":{"$error":"#DIV/0!"}},{"$error":"#DIV/0!"},null,null,null,{"$error":"#DIV/0!"}]
[null,null,null,null,null,null,null,0,null,null,null,0,0,0,{"$error":"#DIV/0!"},{"$error":"#DIV/0!"},{"$error":"#DIV/0!"},{"$error":"#DIV/0!"},{"$error":"#DIV/0!"},{"$error":"#DIV/0!"},{"$error":"#DIV/0!"},{"$f":"IF(A306=\"m\",VLOOKUP(P306,Berechnung_Male!$A$1:$D$42,AA306,TRUE),VLOOKUP(Eingabeblatt!P306,Berechnung_Female!$A$1:$D$42,AA306,TRUE))","v":{"$error":"#DIV/0!"}},{"$error":"#DIV/0!"},null,null,null,{"$error":"#DIV/0!"}]
[null,null,null,null,null,null,null,0,null,null,null,0,0,0,{"$error":"#DIV/0!"},{"$error":"#DIV/0!"},{"$error":"#DIV/0!"},{"$error":"#DIV/0!"},{"$error":"#DIV/0!"},{"$error":"#DIV/0!"},{"$error":"#DIV/0!"},{"$f":"IF(A307=\"m\",VLOOKUP(P307,Berechnung_Male!$A$1:$D$42,AA307,TRUE),VLOOKUP(Eingabeblatt!P307,Berechnung_Female!$A$1:$D$42,AA307,TRUE))","v":{"$error":"#DIV/0!"}},{"$error":"#DIV/0!"},null,null,null,{"$error":"#DIV/0!"}]
[null,null,null,null,null,null,null,0,null,null,null,0,0,0,{"$error":"#DIV/0!"},{"$error":"#DIV/0!"},{"$error":"#DIV/0!"},{"$error":"#DIV/0!"},{"$error":"#DIV/0!"},{"$error":"#DIV/0!"},{"$error":"#DIV/0!"},{"$f":"IF(A308=\"m\",VLOOKUP(P308,Berechnung_Male!$A$1:$D$42,AA308,TRUE),VLOOKUP(Eingabeblatt!P308,Berechnung_Female!$A$1:$D$42,AA308,TRUE))","v":{"$error":"#DIV/0!"}},{"$error":"#DIV/0!"},null,null,null,{"$error":"#DIV/0!"}]
[null,null,null,null,null,null,null,0,null,null,null,0,0,0,{"$error":"#DIV/0!"},{"$error":"#DIV/0!"},{"$error":"#DIV/0!"},{"$error":"#DIV/0!"},{"$error":"#DIV/0!"},{"$error":"#DIV/0!"},{"$error":"#DIV/0!"},{"$f":"IF(A309=\"m\",VLOOKUP(P309,Berechnung_Male!$A$1:$D$42,AA309,TRUE),VLOOKUP(Eingabeblatt!P309,Berechnung_Female!$A$1:$D$42,AA309,TRUE))","v":{"$error":"#DIV/0!"}},{"$error":"#DIV/0!"},null,null,null,{"$error":"#DIV/0!"}]
[null,null,null,null,null,null,null,0,null,null,null,0,0,0,{"$error":"#DIV/0!"},{"$error":"#DIV/0!"},{"$error":"#DIV/0!"},{"$error":"#DIV/0!"},{"$error":"#DIV/0!"},{"$error":"#DIV/0!"},{"$error":"#DIV/0!"},{"$f":"IF(A310=\"m\",VLOOKUP(P310,Berechnung_Male!$A$1:$D$42,AA310,TRUE),VLOOKUP(Eingabeblatt!P310,Berechnung_Female!$A$1:$D$42,AA310,TRUE))","v":{"$error":"#DIV/0!"}},{"$error":"#DIV/0!"},null,null,null,{"$error":"#DIV/0!"}]
[null,null,null,null,null,null,null,0,null,null,null,0,0,0,{"$error":"#DIV/0!"},{"$error":"#DIV/0!"},{"$error":"#DIV/0!"},{"$error":"#DIV/0!"},{"$error":"#DIV/0!"},{"$error":"#DIV/0!"},{"$error":"#DIV/0!"},{"$f":"IF(A311=\"m\",VLOOKUP(P311,Berechnung_Male!$A$1:$D$42,AA311,TRUE),VLOOKUP(Eingabeblatt!P311,Berechnung_Female!$A$1:$D$42,AA311,TRUE))","v":{"$error":"#DIV/0!"}},{"$error":"#DIV/0!"},null,null,null,{"$error":"#DIV/0!"}]
[null,null,null,null,null,null,null,0,null,null,null,0,0,0,{"$error":"#DIV/0!"},{"$error":"#DIV/0!"},{"$error":"#DIV/0!"},{"$error":"#DIV/0!"},{"$error":"#DIV/0!"},{"$error":"#DIV/0!"},{"$error":"#DIV/0!"},{"$f":"IF(A312=\"m\",VLOOKUP(P312,Berechnung_Male!$A$1:$D$42,AA312,TRUE),VLOOKUP(Eingabeblatt!P312,Berechnung_Female!$A$1:$D$42,AA312,TRUE))","v":{"$error":"#DIV/0!"}},{"$error":"#DIV/0!"},null,null,null,{"$error":"#DIV/0!"}]
[null,null,null,null,null,null,null,0,null,null,null,0,0,0,{"$error":"#DIV/0!"},{"$error":"#DIV/0!"},{"$error":"#DIV/0!"},{"$error":"#DIV/0!"},{"$error":"#DIV/0!"},{"$error":"#DIV/0!"},{"$error":"#DIV/0!"},{"$f":"IF(A313=\"m\",VLOOKUP(P313,Berechnung_Male!$A$1:$D$42,AA313,TRUE),VLOOKUP(Eingabeblatt!P313,Berechnung_Female!$A$1:$D$42,AA313,TRUE))","v":{"$error":"#DIV/0!"}},{"$error":"#DIV/0!"},null,null,null,{"$error":"#DIV/0!"}]
[null,null,null,null,null,null,null,0,null,null,null,0,0,0,{"$error":"#DIV/0!"},{"$error":"#DIV/0!"},{"$error":"#DIV/0!"},{"$error":"#DIV/0!"},{"$error":"#DIV/0!"},{"$error":"#DIV/0!"},{"$error":"#DIV/0!"},{"$f":"IF(A314=\"m\",VLOOKUP(P314,Berechnung_Male!$A$1:$D$42,AA314,TRUE),VLOOKUP(Eingabeblatt!P314,Berechnung_Female!$A$1:$D$42,AA314,TRUE))","v":{"$error":"#DIV/0!"}},{"$error":"#DIV/0!"},null,null,null,{"$error":"#DIV/0!"}]
[null,null,null,null,null,null,null,0,null,null,null,0,0,0,{"$error":"#DIV/0!"},{"$error":"#DIV/0!"},{"$error":"#DIV/0!"},{"$error":"#DIV/0!"},{"$error":"#DIV/0!"},{"$error":"#DIV/0!"},{"$error":"#DIV/0!"},{"$f":"IF(A315=\"m\",VLOOKUP(P315,Berechnung_Male!$A$1:$D$42,AA315,TRUE),VLOOKUP(Eingabeblatt!P315,Berechnung_Female!$A$1:$D$42,AA315,TRUE))","v":{"$error":"#DIV/0!"}},{"$error":"#DIV/0!"},null,null,null,{"$error":"#DIV/0!"}]
[null,null,null,null,null,null,null,0,null,null,null,0,0,0,{"$error":"#DIV/0!"},{"$error":"#DIV/0!"},{"$error":"#DIV/0!"},{"$error":"#DIV/0!"},{"$error":"#DIV/0!"},{"$error":"#DIV/0!"},{"$error":"#DIV/0!"},{"$f":"IF(A316=\"m\",VLOOKUP(P316,Berechnung_Male!$A$1:$D$42,AA316,TRUE),VLOOKUP(Eingabeblatt!P316,Berechnung_Female!$A$1:$D$42,AA316,TRUE))","v":{"$error":"#DIV/0!"}},{"$error":"#DIV/0!"},null,null,null,{"$error":"#DIV/0!"}]
[null,null,null,null,null,null,null,0,null,null,null,0,0,0,{"$error":"#DIV/0!"},{"$error":"#DIV/0!"},{"$error":"#DIV/0!"},{"$error":"#DIV/0!"},{"$error":"#DIV/0!"},{"$error":"#DIV/0!"},{"$error":"#DIV/0!"},{"$f":"IF(A317=\"m\",VLOOKUP(P317,Berechnung_Male!$A$1:$D$42,AA317,TRUE),VLOOKUP(Eingabeblatt!P317,Berechnung_Female!$A$1:$D$42,AA317,TRUE))","v":{"$error":"#DIV/0!"}},{"$error":"#DIV/0!"},null,null,null,{"$error":"#DIV/0!"}]
[null,null,null,null,null,null,null,0,null,null,null,0,0,0,{"$error":"#DIV/0!"},{"$error":"#DIV/0!"},{"$error":"#DIV/0!"},{"$error":"#DIV/0!"},{"$error":"#DIV/0!"},{"$error":"#DIV/0!"},{"$error":"#DIV/0!"},{"$f":"IF(A318=\"m\",VLOOKUP(P318,Berechnung_Male!$A$1:$D$42,AA318,TRUE),VLOOKUP(Eingabeblatt!P318,Berechnung_Female!$A$1:$D$42,AA318,TRUE))","v":{"$error":"#DIV/0!"}},{"$error":"#DIV/0!"},null,null,null,{"$error":"#DIV/0!"}]
[null,null,null,null,null,null,null,0,null,null,null,0,0,0,{"$error":"#DIV/0!"},{"$error":"#DIV/0!"},{"$error":"#DIV/0!"},{"$error":"#DIV/0!"},{"$error":"#DIV/0!"},{"$error":"#DIV/0!"},{"$error":"#DIV/0!"},{"$f":"IF(A319=\"m\",VLOOKUP(P319,Berechnung_Male!$A$1:$D$42,AA319,TRUE),VLOOKUP(Eingabeblatt!P319,Berechnung_Female!$A$1:$D$42,AA319,TRUE))","v":{"$error":"#DIV/0!"}},{"$error":"#DIV/0!"},null,null,null,{"$error":"#DIV/0!"}]
[null,null,null,null,null,null,null,0,null,null,null,0,0,0,{"$error":"#DIV/0!"},{"$error":"#DIV/0!"},{"$error":"#DIV/0!"},{"$error":"#DIV/0!"},{"$error":"#DIV/0!"},{"$error":"#DIV/0!"},{"$error":"#DIV/0!"},{"$f":"IF(A320=\"m\",VLOOKUP(P320,Berechnung_Male!$A$1:$D$42,AA320,TRUE),VLOOKUP(Eingabeblatt!P320,Berechnung_Female!$A$1:$D$42,AA320,TRUE))","v":{"$error":"#DIV/0!"}},{"$error":"#DIV/0!"},null,null,null,{"$error":"#DIV/0!"}]
[null,null,null,null,null,null,null,0,null,null,null,0,0,0,{"$error":"#DIV/0!"},{"$error":"#DIV/0!"},{"$error":"#DIV/0!"},{"$error":"#DIV/0!"},{"$error":"#DIV/0!"},{"$error":"#DIV/0!"},{"$error":"#DIV/0!"},{"$f":"IF(A321=\"m\",VLOOKUP(P321,Berechnung_Male!$A$1:$D$42,AA321,TRUE),VLOOKUP(Eingabeblatt!P321,Berechnung_Female!$A$1:$D$42,AA321,TRUE))","v":{"$error":"#DIV/0!"}},{"$error":"#DIV/0!"},null,null,null,{"$error":"#DIV/0!"}]
[null,null,null,null,null,null,null,0,null,null,null,0,0,0,{"$error":"#DIV/0!"},{"$error":"#DIV/0!"},{"$error":"#DIV/0!"},{"$error":"#DIV/0!"},{"$error":"#DIV/0!"},{"$error":"#DIV/0!"},{"$error":"#DIV/0!"},{"$f":"IF(A322=\"m\",VLOOKUP(P322,Berechnung_Male!$A$1:$D$42,AA322,TRUE),VLOOKUP(Eingabeblatt!P322,Berechnung_Female!$A$1:$D$42,AA322,TRUE))","v":{"$error":"#DIV/0!"}},{"$error":"#DIV/0!"},null,null,null,{"$error":"#DIV/0!"}]
[null,null,null,null,null,null,null,0,null,null,null,0,0,0,{"$error":"#DIV/0!"},{"$error":"#DIV/0!"},{"$error":"#DIV/0!"},{"$error":"#DIV/0!"},{"$error":"#DIV/0!"},{"$error":"#DIV/0!"},{"$error":"#DIV/0!"},{"$f":"IF(A323=\"m\",VLOOKUP(P323,Berechnung_Male!$A$1:$D$42,AA323,TRUE),VLOOKUP(Eingabeblatt!P323,Berechnung_Female!$A$1:$D$42,AA323,TRUE))","v":{"$error":"#DIV/0!"}},{"$error":"#DIV/0!"},null,null,null,{"$error":"#DIV/0!"}]
[null,null,null,null,null,null,null,0,null,null,null,0,0,0,{"$error":"#DIV/0!"},{"$error":"#DIV/0!"},{"$error":"#DIV/0!"},{"$error":"#DIV/0!"},{"$error":"#DIV/0!"},{"$error":"#DIV/0!"},{"$error":"#DIV/0!"},{"$f":"IF(A324=\"m\",VLOOKUP(P324,Berechnung_Male!$A$1:$D$42,AA324,TRUE),VLOOKUP(Eingabeblatt!P324,Berechnung_Female!$A$1:$D$42,AA324,TRUE))","v":{"$error":"#DIV/0!"}},{"$error":"#DIV/0!"},null,null,null,{"$error":"#DIV/0!"}]
[null,null,null,null,null,null,null,0,null,null,null,0,0,0,{"$error":"#DIV/0!"},{"$error":"#DIV/0!"},{"$error":"#DIV/0!"},{"$error":"#DIV/0!"},{"$f":"IF(A325=\"m\",(IF(O325<12.8,1,IF(O325<13.3,2,IF(O325>14.8,5,IF(O325>14.3,4,3))))),(IF(O325<11,1,IF(O325<11.5,2,IF(O325>13,5,IF(O325>12.5,4,3))))))","v":{"$error":"#DIV/0!"}},{"$error":"#DIV/0!"},{"$error":"#DIV/0!"},{"$f":"IF(A325=\"m\",VLOOKUP(P325,Berechnung_Male!$A$1:$D$42,AA325,TRUE),VLOOKUP(Eingabeblatt!P325,Berechnung_Female!$A$1:$D$42,AA325,TRUE))","v":{"$error":"#DIV/0!"}},{"$error":"#DIV/0!"},null,null,null,{"$f":"IF(A325=\"m\",IF(O325<12.8,2,IF(O325<14.8,3,4)),IF(O325<11,2,IF(O325<13,3,4)))","v":{"$error":"#DIV/0!"}}]
[null,null,null,null,null,null,null,{"$f":"F326-G326","v":0},null,null,null,{"$f":"J326-K326","v":0},{"$f":"I326-L326","v":0},{"$f":"(B326-E326)/365.25","v":0},{"$f":"N326-P326","v":{"$error":"#DIV/0!"}},{"$f":"IF(A326=\"m\",(-9.236+(0.0002708*M326*L326)+(-0.001663*N326*M326)+(0.007216*N326*L326)+(0.02292*H326/I326*100)),(-9.376+(0.0001882*M326*L326)+(0.0022*N326*M326)+(0.005841*N326*L326)-(0.002658*N326*H326)+(0.07693*(H326/I326)*100)))","v":{"$error":"#DIV/0!"}},{"$f":"IF(R326=1,\"Früh / précoce\",IF(R326=2,\"Durchschnittlich / Normal\",\"Spät / Tardif\"))","v":{"$error":"#DIV/0!"}},{"$f":"IF(A326=\"m\",(IF(O326<12.8,1,IF(O326>14.8,3,2))),(IF(O326<11,1,IF(O326>13,3,2))))","v":{"$error":"#DIV/0!"}},{"$error":"#DIV/0!"},{"$f":"IF(S326=1,\"Früh / précoce\",IF(S326=2,\"Möglicherweise Früh / éventuellement précoce\", IF(S326=3,\"Durchschnittlich / Normal\",IF(S326=4,\"Möglicherweise spät / éventuellement tardif\",\"Spät / Tardif\"))))","v":{"$error":"#DIV/0!"}},{"$f":"I326+V326","v":{"$error":"#DIV/0!"}},{"$f":"IF(A326=\"m\",VLOOKUP(P326,Berechnung_Male!$A$1:$D$42,AA326,TRUE),VLOOKUP(Eingabeblatt!P326,Berechnung_Female!$A$1:$D$42,AA326,TRUE))","v":{"$error":"#DIV/0!"}},{"$f":"I326/U326","v":{"$error":"#DIV/0!"}},null,null,null,{"$error":"#DIV/0!"}]
[null,null,null,null,null,null,null,0,null,null,null,0,0,0,{"$error":"#DIV/0!"},{"$error":"#DIV/0!"},{"$error":"#DIV/0!"},{"$error":"#DIV/0!"},{"$error":"#DIV/0!"},{"$error":"#DIV/0!"},{"$error":"#DIV/0!"},{"$f":"IF(A327=\"m\",VLOOKUP(P327,Berechnung_Male!$A$1:$D$42,AA327,TRUE),VLOOKUP(Eingabeblatt!P327,Berechnung_Female!$A$1:$D$42,AA327,TRUE))","v":{"$error":"#DIV/0!"}},{"$error":"#DIV/0!"},null,null,null,{"$error":"#DIV/0!"}]
[null,null,null,null,null,null,null,0,null,null,null,0,0,0,{"$error":"#DIV/0!"},{"$error":"#DIV/0!"},{"$error":"#DIV/0!"},{"$error":"#DIV/0!"},{"$error":"#DIV/0!"},{"$error":"#DIV/0!"},{"$error":"#DIV/0!"},{"$f":"IF(A328=\"m\",VLOOKUP(P328,Berechnung_Male!$A$1:$D$42,AA328,TRUE),VLOOKUP(Eingabeblatt!P328,Berechnung_Female!$A$1:$D$42,AA328,TRUE))","v":{"$error":"#DIV/0!"}},{"$error":"#DIV/0!"},null,null,null,{"$error":"#DIV/0!"}]
[null,null,null,null,null,null,null,0,null,null,null,0,0,0,{"$error":"#DIV/0!"},{"$error":"#DIV/0!"},{"$error":"#DIV/0!"},{"$error":"#DIV/0!"},{"$error":"#DIV/0!"},{"$error":"#DIV/0!"},{"$error":"#DIV/0!"},{"$f":"IF(A329=\"m\",VLOOKUP(P329,Berechnung_Male!$A$1:$D$42,AA329,TRUE),VLOOKUP(Eingabeblatt!P329,Berechnung_Female!$A$1:$D$42,AA329,TRUE))","v":{"$error":"#DIV/0!"}},{"$error":"#DIV/0!"},null,null,null,{"$error":"#DIV/0!"}]
[null,null,null,null,null,null,null,0,null,null,null,0,0,0,{"$error":"#DIV/0!"},{"$error":"#DIV/0!"},{"$error":"#DIV/0!"},{"$error":"#DIV/0!"},{"$error":"#DIV/0!"},{"$error":"#DIV/0!"},{"$error":"#DIV/0!"},{"$f":"IF(A330=\"m\",VLOOKUP(P330,Berechnung_Male!$A$1:$D$42,AA330,TRUE),VLOOKUP(Eingabeblatt!P330,Berechnung_Female!$A$1:$D$42,AA330,TRUE))","v":{"$error":"#DIV/0!"}},{"$error":"#DIV/0!"},null,null,null,{"$error":"#DIV/0!"}]
[null,null,null,null,null,null,null,0,null,null,null,0,0,0,{"$error":"#DIV/0!"},{"$error":"#DIV/0!"},{"$error":"#DIV/0!"},{"$error":"#DIV/0!"},{"$error":"#DIV/0!"},{"$error":"#DIV/0!"},{"$error":"#DIV/0!"},{"$f":"IF(A331=\"m\",VLOOKUP(P331,Berechnung_Male!$A$1:$D$42,AA331,TRUE),VLOOKUP(Eingabeblatt!P331,Berechnung_Female!$A$1:$D$42,AA331,TRUE))","v":{"$error":"#DIV/0!"}},{"$error":"#DIV/0!"},null,null,null,{"$error":"#DIV/0!"}]
[null,null,null,null,null,null,null,0,null,null,null,0,0,0,{"$error":"#DIV/0!"},{"$error":"#DIV/0!"},{"$error":"#DIV/0!"},{"$error":"#DIV/0!"},{"$error":"#DIV/0!"},{"$error":"#DIV/0!"},{"$error":"#DIV/0!"},{"$f":"IF(A332=\"m\",VLOOKUP(P332,Berechnung_Male!$A$1:$D$42,AA332,TRUE),VLOOKUP(Eingabeblatt!P332,Berechnung_Female!$A$1:$D$42,AA332,TRUE))","v":{"$error":"#DIV/0!"}},{"$error":"#DIV/0!"},null,null,null,{"$error":"#DIV/0!"}]
[null,null,null,null,null,null,null,0,null,null,null,0,0,0,{"$error":"#DIV/0!"},{"$error":"#DIV/0!"},{"$error":"#DIV/0!"},{"$error":"#DIV/0!"},{"$error":"#DIV/0!"},{"$error":"#DIV/0!"},{"$error":"#DIV/0!"},{"$f":"IF(A333=\"m\",VLOOKUP(P333,Berechnung_Male!$A$1:$D$42,AA333,TRUE),VLOOKUP(Eingabeblatt!P333,Berechnung_Female!$A$1:$D$42,AA333,TRUE))","v":{"$error":"#DIV/0!"}},{"$error":"#DIV/0!"},null,null,null,{"$error":"#DIV/0!"}]
[null,null,null,null,null,null,null,0,null,null,null,0,0,0,{"$error":"#DIV/0!"},{"$error":"#DIV/0!"},{"$error":"#DIV/0!"},{"$error":"#DIV/0!"},{"$error":"#DIV/0!"},{"$error":"#DIV/0!"},{"$error":"#DIV/0!"},{"$f":"IF(A334=\"m\",VLOOKUP(P334,Berechnung_Male!$A$1:$D$42,AA334,TRUE),VLOOKUP(Eingabeblatt!P334,Berechnung_Female!$A$1:$D$42,AA334,TRUE))","v":{"$error":"#DIV/0!"}},{"$error":"#DIV/0!"},null,null,null,{"$error":"#DIV/0!"}]
[null,null,null,null,null,null,null,0,null,null,null,0,0,0,{"$error":"#DIV/0!"},{"$error":"#DIV/0!"},{"$error":"#DIV/0!"},{"$error":"#DIV/0!"},{"$error":"#DIV/0!"},{"$error":"#DIV/0!"},{"$error":"#DIV/0!"},{"$f":"IF(A335=\"m\",VLOOKUP(P335,Berechnung_Male!$A$1:$D$42,AA335,TRUE),VLOOKUP(Eingabeblatt!P335,Berechnung_Female!$A$1:$D$42,AA335,TRUE))","v":{"$error":"#DIV/0!"}},{"$error":"#DIV/0!"},null,null,null,{"$error":"#DIV/0!"}]
[null,null,null,null,null,null,null,0,null,null,null,0,0,0,{"$error":"#DIV/0!"},{"$error":"#DIV/0!"},{"$error":"#DIV/0!"},{"$error":"#DIV/0!"},{"$error":"#DIV/0!"},{"$error":"#DIV/0!"},{"$error":"#DIV/0!"},{"$f":"IF(A336=\"m\",VLOOKUP(P336,Berechnung_Male!$A$1:$D$42,AA336,TRUE),VLOOKUP(Eingabeblatt!P336,Berechnung_Female!$A$1:$D$42,AA336,TRUE))","v":{"$error":"#DIV/0!"}},{"$error":"#DIV/0!"},null,null,null,{"$error":"#DIV/0!"}]
[null,null,null,null,null,null,null,0,null,null,null,0,0,0,{"$error":"#DIV/0!"},{"$error":"#DIV/0!"},{"$error":"#DIV/0!"},{"$error":"#DIV/0!"},{"$error":"#DIV/0!"},{"$error":"#DIV/0!"},{"$error":"#DIV/0!"},{"$f":"IF(A337=\"m\",VLOOKUP(P337,Berechnung_Male!$A$1:$D$42,AA337,TRUE),VLOOKUP(Eingabeblatt!P337,Berechnung_Female!$A$1:$D$42,AA337,TRUE))","v":{"$error":"#DIV/0!"}},{"$error":"#DIV/0!"},null,null,null,{"$error":"#DIV/0!"}]
[null,null,null,null,null,null,null,0,null,null,null,0,0,0,{"$error":"#DIV/0!"},{"$error":"#DIV/0!"},{"$error":"#DIV/0!"},{"$error":"#DIV/0!"},{"$error":"#DIV/0!"},{"$error":"#DIV/0!"},{"$error":"#DIV/0!"},{"$f":"IF(A338=\"m\",VLOOKUP(P338,Berechnung_Male!$A$1:$D$42,AA338,TRUE),VLOOKUP(Eingabeblatt!P338,Berechnung_Female!$A$1:$D$42,AA338,TRUE))","v":{"$error":"#DIV/0!"}},{"$error":"#DIV/0!"},null,null,null,{"$error":"#DIV/0!"}]
[null,null,null,null,null,null,null,0,null,null,null,0,0,0,{"$error":"#DIV/0!"},{"$error":"#DIV/0!"},{"$error":"#DIV/0!"},{"$error":"#DIV/0!"},{"$error":"#DIV/0!"},{"$error":"#DIV/0!"},{"$error":"#DIV/0!"},{"$f":"IF(A339=\"m\",VLOOKUP(P339,Berechnung_Male!$A$1:$D$42,AA339,TRUE),VLOOKUP(Eingabeblatt!P339,Berechnung_Female!$A$1:$D$42,AA339,TRUE))","v":{"$error":"#DIV/0!"}},{"$error":"#DIV/0!"},null,null,null,{"$error":"#DIV/0!"}]
[null,null,null,null,null,null,null,0,null,null,null,0,0,0,{"$error":"#DIV/0!"},{"$error":"#DIV/0!"},{"$error":"#DIV/0!"},{"$error":"#DIV/0!"},{"$error":"#DIV/0!"},{"$error":"#DIV/0!"},{"$error":"#DIV/0!"},{"$f":"IF(A340=\"m\",VLOOKUP(P340,Berechnung_Male!$A$1:$D$42,AA340,TRUE),VLOOKUP(Eingabeblatt!P340,Berechnung_Female!$A$1:$D$42,AA340,TRUE))","v":{"$error":"#DIV/0!"}},{"$error":"#DIV/0!"},null,null,null,{"$error":"#DIV/0!"}]
[null,null,null,null,null,null,null,0,null,null,null,0,0,0,{"$error":"#DIV/0!"},{"$error":"#DIV/0!"},{"$error":"#DIV/0!"},{"$error":"#DIV/0!"},{"$error":"#DIV/0!"},{"$error":"#DIV/0!"},{"$error":"#DIV/0!"},{"$f":"IF(A341=\"m\",VLOOKUP(P341,Berechnung_Male!$A$1:$D$42,AA341,TRUE),VLOOKUP(Eingabeblatt!P341,Berechnung_Female!$A$1:$D$42,AA341,TRUE))","v":{"$error":"#DIV/0!"}},{"$error":"#DIV/0!"},null,null,null,{"$error":"#DIV/0!"}]
[null,null,null,null,null,null,null,0,null,null,null,0,0,0,{"$error":"#DIV/0!"},{"$error":"#DIV/0!"},{"$error":"#DIV/0!"},{"$error":"#DIV/0!"},{"$error":"#DIV/0!"},{"$error":"#DIV/0!"},{"$error":"#DIV/0!"},{"$f":"IF(A342=\"m\",VLOOKUP(P342,Berechnung_Male!$A$1:$D$42,AA342,TRUE),VLOOKUP(Eingabeblatt!P342,Berechnung_Female!$A$1:$D$42,AA342,TRUE))","v":{"$error":"#DIV/0!"}},{"$error":"#DIV/0!"},null,null,null,{"$error":"#DIV/0!"}]
[null,null,null,null,null,null,null,0,null,null,null,0,0,0,{"$error":"#DIV/0!"},{"$error":"#DIV/0!"},{"$error":"#DIV/0!"},{"$error":"#DIV/0!"},{"$error":"#DIV/0!"},{"$error":"#DIV/0!"},{"$error":"#DIV/0!"},{"$f":"IF(A343=\"m\",VLOOKUP(P343,Berechnung_Male!$A$1:$D$42,AA343,TRUE),VLOOKUP(Eingabeblatt!P343,Berechnung_Female!$A$1:$D$42,AA343,TRUE))","v":{"$error":"#DIV/0!"}},{"$error":"#DIV/0!"},null,null,null,{"$error":"#DIV/0!"}]
[null,null,null,null,null,null,null,0,null,null,null,0,0,0,{"$error":"#DIV/0!"},{"$error":"#DIV/0!"},{"$error":"#DIV/0!"},{"$error":"#DIV/0!"},{"$error":"#DIV/0!"},{"$error":"#DIV/0!"},{"$error":"#DIV/0!"},{"$f":"IF(A344=\"m\",VLOOKUP(P344,Berechnung_Male!$A$1:$D$42,AA344,TRUE),VLOOKUP(Eingabeblatt!P344,Berechnung_Female!$A$1:$D$42,AA344,TRUE))","v":{"$error":"#DIV/0!"}},{"$error":"#DIV/0!"},null,null,null,{"$error":"#DIV/0!"}]
[null,null,null,null,null,null,null,0,null,null,null,0,0,0,{"$error":"#DIV/0!"},{"$error":"#DIV/0!"},{"$error":"#DIV/0!"},{"$error":"#DIV/0!"},{"$error":"#DIV/0!"},{"$error":"#DIV/0!"},{"$error":"#DIV/0!"},{"$f":"IF(A345=\"m\",VLOOKUP(P345,Berechnung_Male!$A$1:$D$42,AA345,TRUE),VLOOKUP(Eingabeblatt!P345,Berechnung_Female!$A$1:$D$42,AA345,TRUE))","v":{"$error":"#DIV/0!"}},{"$error":"#DIV/0!"},null,null,null,{"$error":"#DIV/0!"}]
[null,null,null,null,null,null,null,0,null,null,null,0,0,0,{"$error":"#DIV/0!"},{"$error":"#DIV/0!"},{"$error":"#DIV/0!"},{"$error":"#DIV/0!"},{"$error":"#DIV/0!"},{"$error":"#DIV/0!"},{"$error":"#DIV/0!"},{"$f":"IF(A346=\"m\",VLOOKUP(P346,Berechnung_Male!$A$1:$D$42,AA346,TRUE),VLOOKUP(Eingabeblatt!P346,Berechnung_Female!$A$1:$D$42,AA346,TRUE))","v":{"$error":"#DIV/0!"}},{"$error":"#DIV/0!"},null,null,null,{"$error":"#DIV/0!"}]
[null,null,null,null,null,null,null,0,null,null,null,0,0,0,{"$error":"#DIV/0!"},{"$error":"#DIV/0!"},{"$error":"#DIV/0!"},{"$error":"#DIV/0!"},{"$error":"#DIV/0!"},{"$error":"#DIV/0!"},{"$error":"#DIV/0!"},{"$f":"IF(A347=\"m\",VLOOKUP(P347,Berechnung_Male!$A$1:$D$42,AA347,TRUE),VLOOKUP(Eingabeblatt!P347,Berechnung_Female!$A$1:$D$42,AA347,TRUE))","v":{"$error":"#DIV/0!"}},{"$error":"#DIV/0!"},null,null,null,{"$error":"#DIV/0!"}]
[null,null,null,null,null,null,null,0,null,null,null,0,0,0,{"$error":"#DIV/0!"},{"$error":"#DIV/0!"},{"$error":"#DIV/0!"},{"$error":"#DIV/0!"},{"$error":"#DIV/0!"},{"$error":"#DIV/0!"},{"$error":"#DIV/0!"},{"$f":"IF(A348=\"m\",VLOOKUP(P348,Berechnung_Male!$A$1:$D$42,AA348,TRUE),VLOOKUP(Eingabeblatt!P348,Berechnung_Female!$A$1:$D$42,AA348,TRUE))","v":{"$error":"#DIV/0!"}},{"$error":"#DIV/0!"},null,null,null,{"$error":"#DIV/0!"}]
[null,null,null,null,null,null,null,0,null,null,null,0,0,0,{"$error":"#DIV/0!"},{"$error":"#DIV/0!"},{"$error":"#DIV/0!"},{"$error":"#DIV/0!"},{"$error":"#DIV/0!"},{"$error":"#DIV/0!"},{"$error":"#DIV/0!"},{"$f":"IF(A349=\"m\",VLOOKUP(P349,Berechnung_Male!$A$1:$D$42,AA349,TRUE),VLOOKUP(Eingabeblatt!P349,Berechnung_Female!$A$1:$D$42,AA349,TRUE))","v":{"$error":"#DIV/0!"}},{"$error":"#DIV/0!"},null,null,null,{"$error":"#DIV/0!"}]
[null,null,null,null,null,null,null,0,null,null,null,0,0,0,{"$error":"#DIV/0!"},{"$error":"#DIV/0!"},{"$error":"#DIV/0!"},{"$error":"#DIV/0!"},{"$error":"#DIV/0!"},{"$error":"#DIV/0!"},{"$error":"#DIV/0!"},{"$f":"IF(A350=\"m\",VLOOKUP(P350,Berechnung_Male!$A$1:$D$42,AA350,TRUE),VLOOKUP(Eingabeblatt!P350,Berechnung_Female!$A$1:$D$42,AA350,TRUE))","v":{"$error":"#DIV/0!"}},{"$error":"#DIV/0!"},null,null,null,{"$error":"#DIV/0!"}]
[null,null,null,null,null,null,null,0,null,null,null,0,0,0,{"$error":"#DIV/0!"},{"$error":"#DIV/0!"},{"$error":"#DIV/0!"},{"$error":"#DIV/0!"},{"$error":"#DIV/0!"},{"$error":"#DIV/0!"},{"$error":"#DIV/0!"},{"$f":"IF(A351=\"m\",VLOOKUP(P351,Berechnung_Male!$A$1:$D$42,AA351,TRUE),VLOOKUP(Eingabeblatt!P351,Berechnung_Female!$A$1:$D$42,AA351,TRUE))","v":{"$error":"#DIV/0!"}},{"$error":"#DIV/0!"},null,null,null,{"$error":"#DIV/0!"}]
[null,null,null,null,null,null,null,0,null,null,null,0,0,0,{"$error":"#DIV/0!"},{"$error":"#DIV/0!"},{"$error":"#DIV/0!"},{"$error":"#DIV/0!"},{"$error":"#DIV/0!"},{"$error":"#DIV/0!"},{"$error":"#DIV/0!"},{"$f":"IF(A352=\"m\",VLOOKUP(P352,Berechnung_Male!$A$1:$D$42,AA352,TRUE),VLOOKUP(Eingabeblatt!P352,Berechnung_Female!$A$1:$D$42,AA352,TRUE))","v":{"$error":"#DIV/0!"}},{"$error":"#DIV/0!"},null,null,null,{"$error":"#DIV/0!"}]
[null,null,null,null,null,null,null,0,null,null,null,0,0,0,{"$error":"#DIV/0!"},{"$error":"#DIV/0!"},{"$error":"#DIV/0!"},{"$error":"#DIV/0!"},{"$error":"#DIV/0!"},{"$error":"#DIV/0!"},{"$error":"#DIV/0!"},{"$f":"IF(A353=\"m\",VLOOKUP(P353,Berechnung_Male!$A$1:$D$42,AA353,TRUE),VLOOKUP(Eingabeblatt!P353,Berechnung_Female!$A$1:$D$42,AA353,TRUE))","v":{"$error":"#DIV/0!"}},{"$error":"#DIV/0!"},null,null,null,{"$error":"#DIV/0!"}]
[null,null,null,null,null,null,null,0,null,null,null,0,0,0,{"$error":"#DIV/0!"},{"$error":"#DIV/0!"},{"$error":"#DIV/0!"},{"$error":"#DIV/0!"},{"$error":"#DIV/0!"},{"$error":"#DIV/0!"},{"$error":"#DIV/0!"},{"$f":"IF(A354=\"m\",VLOOKUP(P354,Berechnung_Male!$A$1:$D$42,AA354,TRUE),VLOOKUP(Eingabeblatt!P354,Berechnung_Female!$A$1:$D$42,AA354,TRUE))","v":{"$error":"#DIV/0!"}},{"$error":"#DIV/0!"},null,null,null,{"$error":"#DIV/0!"}]
[null,null,null,null,null,null,null,0,null,null,null,0,0,0,{"$error":"#DIV/0!"},{"$error":"#DIV/0!"},{"$error":"#DIV/0!"},{"$error":"#DIV/0!"},{"$error":"#DIV/0!"},{"$error":"#DIV/0!"},{"$error":"#DIV/0!"},{"$f":"IF(A355=\"m\",VLOOKUP(P355,Berechnung_Male!$A$1:$D$42,AA355,TRUE),VLOOKUP(Eingabeblatt!P355,Berechnung_Female!$A$1:$D$42,AA355,TRUE))","v":{"$error":"#DIV/0!"}},{"$error":"#DIV/0!"},null,null,null,{"$error":"#DIV/0!"}]
[null,null,null,null,null,null,null,0,null,null,null,0,0,0,{"$error":"#DIV/0!"},{"$error":"#DIV/0!"},{"$error":"#DIV/0!"},{"$error":"#DIV/0!"},{"$error":"#DIV/0!"},{"$error":"#DIV/0!"},{"$error":"#DIV/0!"},{"$f":"IF(A356=\"m\",VLOOKUP(P356,Berechnung_Male!$A$1:$D$42,AA356,TRUE),VLOOKUP(Eingabeblatt!P356,Berechnung_Female!$A$1:$D$42,AA356,TRUE))","v":{"$error":"#DIV/0!"}},{"$error":"#DIV/0!"},null,null,null,{"$error":"#DIV/0!"}]
[null,null,null,null,null,null,null,0,null,null,null,0,0,0,{"$error":"#DIV/0!"},{"$error":"#DIV/0!"},{"$error":"#DIV/0!"},{"$error":"#DIV/0!"},{"$error":"#DIV/0!"},{"$error":"#DIV/0!"},{"$error":"#DIV/0!"},{"$f":"IF(A357=\"m\",VLOOKUP(P357,Berechnung_Male!$A$1:$D$42,AA357,TRUE),VLOOKUP(Eingabeblatt!P357,Berechnung_Female!$A$1:$D$42,AA357,TRUE))","v":{"$error":"#DIV/0!"}},{"$error":"#DIV/0!"},null,null,null,{"$error":"#DIV/0!"}]
[null,null,null,null,null,null,null,0,null,null,null,0,0,0,{"$error":"#DIV/0!"},{"$error":"#DIV/0!"},{"$error":"#DIV/0!"},{"$error":"#DIV/0!"},{"$error":"#DIV/0!"},{"$error":"#DIV/0!"},{"$error":"#DIV/0!"},{"$f":"IF(A358=\"m\",VLOOKUP(P358,Berechnung_Male!$A$1:$D$42,AA358,TRUE),VLOOKUP(Eingabeblatt!P358,Berechnung_Female!$A$1:$D$42,AA358,TRUE))","v":{"$error":"#DIV/0!"}},{"$error":"#DIV/0!"},null,null,null,{"$error":"#DIV/0!"}]
[null,null,null,null,null,null,null,0,null,null,null,0,0,0,{"$error":"#DIV/0!"},{"$error":"#DIV/0!"},{"$error":"#DIV/0!"},{"$error":"#DIV/0!"},{"$error":"#DIV/0!"},{"$error":"#DIV/0!"},{"$error":"#DIV/0!"},{"$f":"IF(A359=\"m\",VLOOKUP(P359,Berechnung_Male!$A$1:$D$42,AA359,TRUE),VLOOKUP(Eingabeblatt!P359,Berechnung_Female!$A$1:$D$42,AA359,TRUE))","v":{"$error":"#DIV/0!"}},{"$error":"#DIV/0!"},null,null,null,{"$error":"#DIV/0!"}]
[null,null,null,null,null,null,null,0,null,null,null,0,0,0,{"$error":"#DIV/0!"},{"$error":"#DIV/0!"},{"$error":"#DIV/0!"},{"$error":"#DIV/0!"},{"$error":"#DIV/0!"},{"$error":"#DIV/0!"},{"$error":"#DIV/0!"},{"$f":"IF(A360=\"m\",VLOOKUP(P360,Berechnung_Male!$A$1:$D$42,AA360,TRUE),VLOOKUP(Eingabeblatt!P360,Berechnung_Female!$A$1:$D$42,AA360,TRUE))","v":{"$error":"#DIV/0!"}},{"$error":"#DIV/0!"},null,null,null,{"$error":"#DIV/0!"}]
[null,null,null,null,null,null,null,0,null,null,null,0,0,0,{"$error":"#DIV/0!"},{"$error":"#DIV/0!"},{"$error":"#DIV/0!"},{"$error":"#DIV/0!"},{"$error":"#DIV/0!"},{"$error":"#DIV/0!"},{"$error":"#DIV/0!"},{"$f":"IF(A361=\"m\",VLOOKUP(P361,Berechnung_Male!$A$1:$D$42,AA361,TRUE),VLOOKUP(Eingabeblatt!P361,Berechnung_Female!$A$1:$D$42,AA361,TRUE))","v":{"$error":"#DIV/0!"}},{"$error":"#DIV/0!"},null,null,null,{"$error":"#DIV/0!"}]
[null,null,null,null,null,null,null,0,null,null,null,0,0,0,{"$error":"#DIV/0!"},{"$error":"#DIV/0!"},{"$error":"#DIV/0!"},{"$error":"#DIV/0!"},{"$error":"#DIV/0!"},{"$error":"#DIV/0!"},{"$error":"#DIV/0!"},{"$f":"IF(A362=\"m\",VLOOKUP(P362,Berechnung_Male!$A$1:$D$42,AA362,TRUE),VLOOKUP(Eingabeblatt!P362,Berechnung_Female!$A$1:$D$42,AA362,TRUE))","v":{"$error":"#DIV/0!"}},{"$error":"#DIV/0!"},null,null,null,{"$error":"#DIV/0!"}]
[null,null,null,null,null,null,null,0,null,null,null,0,0,0,{"$error":"#DIV/0!"},{"$error":"#DIV/0!"},{"$error":"#DIV/0!"},{"$error":"#DIV/0!"},{"$error":"#DIV/0!"},{"$error":"#DIV/0!"},{"$error":"#DIV/0!"},{"$f":"IF(A363=\"m\",VLOOKUP(P363,Berechnung_Male!$A$1:$D$42,AA363,TRUE),VLOOKUP(Eingabeblatt!P363,Berechnung_Female!$A$1:$D$42,AA363,TRUE))","v":{"$error":"#DIV/0!"}},{"$error":"#DIV/0!"},null,null,null,{"$error":"#DIV/0!"}]
[null,null,null,null,null,null,null,0,null,null,null,0,0,0,{"$error":"#DIV/0!"},{"$error":"#DIV/0!"},{"$error":"#DIV/0!"},{"$error":"#DIV/0!"},{"$error":"#DIV/0!"},{"$error":"#DIV/0!"},{"$error":"#DIV/0!"},{"$f":"IF(A364=\"m\",VLOOKUP(P364,Berechnung_Male!$A$1:$D$42,AA364,TRUE),VLOOKUP(Eingabeblatt!P364,Berechnung_Female!$A$1:$D$42,AA364,TRUE))","v":{"$error":"#DIV/0!"}},{"$error":"#DIV/0!"},null,null,null,{"$error":"#DIV/0!"}]
[null,null,null,null,null,null,null,0,null,null,null,0,0,0,{"$error":"#DIV/0!"},{"$error":"#DIV/0!"},{"$error":"#DIV/0!"},{"$error":"#DIV/0!"},{"$error":"#DIV/0!"},{"$error":"#DIV/0!"},{"$error":"#DIV/0!"},{"$f":"IF(A365=\"m\",VLOOKUP(P365,Berechnung_Male!$A$1:$D$42,AA365,TRUE),VLOOKUP(Eingabeblatt!P365,Berechnung_Female!$A$1:$D$42,AA365,TRUE))","v":{"$error":"#DIV/0!"}},{"$error":"#DIV/0!"},null,null,null,{"$error":"#DIV/0!"}]
[null,null,null,null,null,null,null,0,null,null,null,0,0,0,{"$error":"#DIV/0!"},{"$error":"#DIV/0!"},{"$error":"#DIV/0!"},{"$error":"#DIV/0!"},{"$error":"#DIV/0!"},{"$error":"#DIV/0!"},{"$error":"#DIV/0!"},{"$f":"IF(A366=\"m\",VLOOKUP(P366,Berechnung_Male!$A$1:$D$42,AA366,TRUE),VLOOKUP(Eingabeblatt!P366,Berechnung_Female!$A$1:$D$42,AA366,TRUE))","v":{"$error":"#DIV/0!"}},{"$error":"#DIV/0!"},null,null,null,{"$error":"#DIV/0!"}]
[null,null,null,null,null,null,null,0,null,null,null,0,0,0,{"$error":"#DIV/0!"},{"$error":"#DIV/0!"},{"$error":"#DIV/0!"},{"$error":"#DIV/0!"},{"$error":"#DIV/0!"},{"$error":"#DIV/0!"},{"$error":"#DIV/0!"},{"$f":"IF(A367=\"m\",VLOOKUP(P367,Berechnung_Male!$A$1:$D$42,AA367,TRUE),VLOOKUP(Eingabeblatt!P367,Berechnung_Female!$A$1:$D$42,AA367,TRUE))","v":{"$error":"#DIV/0!"}},{"$error":"#DIV/0!"},null,null,null,{"$error":"#DIV/0!"}]
[null,null,null,null,null,null,null,0,null,null,null,0,0,0,{"$error":"#DIV/0!"},{"$error":"#DIV/0!"},{"$error":"#DIV/0!"},{"$error":"#DIV/0!"},{"$error":"#DIV/0!"},{"$error":"#DIV/0!"},{"$error":"#DIV/0!"},{"$f":"IF(A368=\"m\",VLOOKUP(P368,Berechnung_Male!$A$1:$D$42,AA368,TRUE),VLOOKUP(Eingabeblatt!P368,Berechnung_Female!$A$1:$D$42,AA368,TRUE))","v":{"$error":"#DIV/0!"}},{"$error":"#DIV/0!"},null,null,null,{"$error":"#DIV/0!"}]
[null,null,null,null,null,null,null,0,null,null,null,0,0,0,{"$error":"#DIV/0!"},{"$error":"#DIV/0!"},{"$error":"#DIV/0!"},{"$error":"#DIV/0!"},{"$error":"#DIV/0!"},{"$error":"#DIV/0!"},{"$error":"#DIV/0!"},{"$f":"IF(A369=\"m\",VLOOKUP(P369,Berechnung_Male!$A$1:$D$42,AA369,TRUE),VLOOKUP(Eingabeblatt!P369,Berechnung_Female!$A$1:$D$42,AA369,TRUE))","v":{"$error":"#DIV/0!"}},{"$error":"#DIV/0!"},null,null,null,{"$error":"#DIV/0!"}]
[null,null,null,null,null,null,null,0,null,null,null,0,0,0,{"$error":"#DIV/0!"},{"$error":"#DIV/0!"},{"$error":"#DIV/0!"},{"$error":"#DIV/0!"},{"$error":"#DIV/0!"},{"$error":"#DIV/0!"},{"$error":"#DIV/0!"},{"$f":"IF(A370=\"m\",VLOOKUP(P370,Berechnung_Male!$A$1:$D$42,AA370,TRUE),VLOOKUP(Eingabeblatt!P370,Berechnung_Female!$A$1:$D$42,AA370,TRUE))","v":{"$error":"#DIV/0!"}},{"$error":"#DIV/0!"},null,null,null,{"$error":"#DIV/0!"}]
[null,null,null,null,null,null,null,0,null,null,null,0,0,0,{"$error":"#DIV/0!"},{"$error":"#DIV/0!"},{"$error":"#DIV/0!"},{"$error":"#DIV/0!"},{"$error":"#DIV/0!"},{"$error":"#DIV/0!"},{"$error":"#DIV/0!"},{"$f":"IF(A371=\"m\",VLOOKUP(P371,Berechnung_Male!$A$1:$D$42,AA371,TRUE),VLOOKUP(Eingabeblatt!P371,Berechnung_Female!$A$1:$D$42,AA371,TRUE))","v":{"$error":"#DIV/0!"}},{"$error":"#DIV/0!"},null,null,null,{"$error":"#DIV/0!"}]
[null,null,null,null,null,null,null,0,null,null,null,0,0,0,{"$error":"#DIV/0!"},{"$error":"#DIV/0!"},{"$error":"#DIV/0!"},{"$error":"#DIV/0!"},{"$error":"#DIV/0!"},{"$error":"#DIV/0!"},{"$error":"#DIV/0!"},{"$f":"IF(A372=\"m\",VLOOKUP(P372,Berechnung_Male!$A$1:$D$42,AA372,TRUE),VLOOKUP(Eingabeblatt!P372,Berechnung_Female!$A$1:$D$42,AA372,TRUE))","v":{"$error":"#DIV/0!"}},{"$error":"#DIV/0!"},null,null,null,{"$error":"#DIV/0!"}]
[null,null,null,null,null,null,null,0,null,null,null,0,0,0,{"$error":"#DIV/0!"},{"$error":"#DIV/0!"},{"$error":"#DIV/0!"},{"$error":"#DIV/0!"},{"$error":"#DIV/0!"},{"$error":"#DIV/0!"},{"$error":"#DIV/0!"},{"$f":"IF(A373=\"m\",VLOOKUP(P373,Berechnung_Male!$A$1:$D$42,AA373,TRUE),VLOOKUP(Eingabeblatt!P373,Berechnung_Female!$A$1:$D$42,AA373,TRUE))","v":{"$error":"#DIV/0!"}},{"$error":"#DIV/0!"},null,null,null,{"$error":"#DIV/0!"}]
[null,null,null,null,null,null,null,0,null,null,null,0,0,0,{"$error":"#DIV/0!"},{"$error":"#DIV/0!"},{"$error":"#DIV/0!"},{"$error":"#DIV/0!"},{"$error":"#DIV/0!"},{"$error":"#DIV/0!"},{"$error":"#DIV/0!"},{"$f":"IF(A374=\"m\",VLOOKUP(P374,Berechnung_Male!$A$1:$D$42,AA374,TRUE),VLOOKUP(Eingabeblatt!P374,Berechnung_Female!$A$1:$D$42,AA374,TRUE))","v":{"$error":"#DIV/0!"}},{"$error":"#DIV/0!"},null,null,null,{"$error":"#DIV/0!"}]
[null,null,null,null,null,null,null,0,null,null,null,0,0,0,{"$error":"#DIV/0!"},{"$error":"#DIV/0!"},{"$error":"#DIV/0!"},{"$error":"#DIV/0!"},{"$error":"#DIV/0!"},{"$error":"#DIV/0!"},{"$error":"#DIV/0!"},{"$f":"IF(A375=\"m\",VLOOKUP(P375,Berechnung_Male!$A$1:$D$42,AA375,TRUE),VLOOKUP(Eingabeblatt!P375,Berechnung_Female!$A$1:$D$42,AA375,TRUE))","v":{"$error":"#DIV/0!"}},{"$error":"#DIV/0!"},null,null,null,{"$error":"#DIV/0!"}]
[null,null,null,null,null,null,null,0,null,null,null,0,0,0,{"$error":"#DIV/0!"},{"$error":"#DIV/0!"},{"$error":"#DIV/0!"},{"$error":"#DIV/0!"},{"$error":"#DIV/0!"},{"$error":"#DIV/0!"},{"$error":"#DIV/0!"},{"$f":"IF(A376=\"m\",VLOOKUP(P376,Berechnung_Male!$A$1:$D$42,AA376,TRUE),VLOOKUP(Eingabeblatt!P376,Berechnung_Female!$A$1:$D$42,AA376,TRUE))","v":{"$error":"#DIV/0!"}},{"$error":"#DIV/0!"},null,null,null,{"$error":"#DIV/0!"}]
[null,null,null,null,null,null,null,0,null,null,null,0,0,0,{"$error":"#DIV/0!"},{"$error":"#DIV/0!"},{"$error":"#DIV/0!"},{"$error":"#DIV/0!"},{"$error":"#DIV/0!"},{"$error":"#DIV/0!"},{"$error":"#DIV/0!"},{"$f":"IF(A377=\"m\",VLOOKUP(P377,Berechnung_Male!$A$1:$D$42,AA377,TRUE),VLOOKUP(Eingabeblatt!P377,Berechnung_Female!$A$1:$D$42,AA377,TRUE))","v":{"$error":"#DIV/0!"}},{"$error":"#DIV/0!"},null,null,null,{"$error":"#DIV/0!"}]
[null,null,null,null,null,null,null,0,null,null,null,0,0,0,{"$error":"#DIV/0!"},{"$error":"#DIV/0!"},{"$error":"#DIV/0!"},{"$error":"#DIV/0!"},{"$error":"#DIV/0!"},{"$error":"#DIV/0!"},{"$error":"#DIV/0!"},{"$f":"IF(A378=\"m\",VLOOKUP(P378,Berechnung_Male!$A$1:$D$42,AA378,TRUE),VLOOKUP(Eingabeblatt!P378,Berechnung_Female!$A$1:$D$42,AA378,TRUE))","v":{"$error":"#DIV/0!"}},{"$error":"#DIV/0!"},null,null,null,{"$error":"#DIV/0!"}]
[null,null,null,null,null,null,null,0,null,null,null,0,0,0,{"$error":"#DIV/0!"},{"$error":"#DIV/0!"},{"$error":"#DIV/0!"},{"$error":"#DIV/0!"},{"$error":"#DIV/0!"},{"$error":"#DIV/0!"},{"$error":"#DIV/0!"},{"$f":"IF(A379=\"m\",VLOOKUP(P379,Berechnung_Male!$A$1:$D$42,AA379,TRUE),VLOOKUP(Eingabeblatt!P379,Berechnung_Female!$A$1:$D$42,AA379,TRUE))","v":{"$error":"#DIV/0!"}},{"$error":"#DIV/0!"},null,null,null,{"$error":"#DIV/0!"}]
[null,null,null,null,null,null,null,0,null,null,null,0,0,0,{"$error":"#DIV/0!"},{"$error":"#DIV/0!"},{"$error":"#DIV/0!"},{"$error":"#DIV/0!"},{"$error":"#DIV/0!"},{"$error":"#DIV/0!"},{"$error":"#DIV/0!"},{"$f":"IF(A380=\"m\",VLOOKUP(P380,Berechnung_Male!$A$1:$D$42,AA380,TRUE),VLOOKUP(Eingabeblatt!P380,Berechnung_Female!$A$1:$D$42,AA380,TRUE))","v":{"$error":"#DIV/0!"}},{"$error":"#DIV/0!"},null,null,null,{"$error":"#DIV/0!"}]
[null,null,null,null,null,null,null,0,null,null,null,0,0,0,{"$error":"#DIV/0!"},{"$error":"#DIV/0!"},{"$error":"#DIV/0!"},{"$error":"#DIV/0!"},{"$error":"#DIV/0!"},{"$error":"#DIV/0!"},{"$error":"#DIV/0!"},{"$f":"IF(A381=\"m\",VLOOKUP(P381,Berechnung_Male!$A$1:$D$42,AA381,TRUE),VLOOKUP(Eingabeblatt!P381,Berechnung_Female!$A$1:$D$42,AA381,TRUE))","v":{"$error":"#DIV/0!"}},{"$error":"#DIV/0!"},null,null,null,{"$error":"#DIV/0!"}]
[null,null,null,null,null,null,null,0,null,null,null,0,0,0,{"$error":"#DIV/0!"},{"$error":"#DIV/0!"},{"$error":"#DIV/0!"},{"$error":"#DIV/0!"},{"$error":"#DIV/0!"},{"$error":"#DIV/0!"},{"$error":"#DIV/0!"},{"$f":"IF(A382=\"m\",VLOOKUP(P382,Berechnung_Male!$A$1:$D$42,AA382,TRUE),VLOOKUP(Eingabeblatt!P382,Berechnung_Female!$A$1:$D$42,AA382,TRUE))","v":{"$error":"#DIV/0!"}},{"$error":"#DIV/0!"},null,null,null,{"$error":"#DIV/0!"}]
[null,null,null,null,null,null,null,0,null,null,null,0,0,0,{"$error":"#DIV/0!"},{"$error":"#DIV/0!"},{"$error":"#DIV/0!"},{"$error":"#DIV/0!"},{"$error":"#DIV/0!"},{"$error":"#DIV/0!"},{"$error":"#DIV/0!"},{"$f":"IF(A383=\"m\",VLOOKUP(P383,Berechnung_Male!$A$1:$D$42,AA383,TRUE),VLOOKUP(Eingabeblatt!P383,Berechnung_Female!$A$1:$D$42,AA383,TRUE))","v":{"$error":"#DIV/0!"}},{"$error":"#DIV/0!"},null,null,null,{"$error":"#DIV/0!"}]
[null,null,null,null,null,null,null,0,null,null,null,0,0,0,{"$error":"#DIV/0!"},{"$error":"#DIV/0!"},{"$error":"#DIV/0!"},{"$error":"#DIV/0!"},{"$error":"#DIV/0!"},{"$error":"#DIV/0!"},{"$error":"#DIV/0!"},{"$f":"IF(A384=\"m\",VLOOKUP(P384,Berechnung_Male!$A$1:$D$42,AA384,TRUE),VLOOKUP(Eingabeblatt!P384,Berechnung_Female!$A$1:$D$42,AA384,TRUE))","v":{"$error":"#DIV/0!"}},{"$error":"#DIV/0!"},null,null,null,{"$error":"#DIV/0!"}]
[null,null,null,null,null,null,null,0,null,null,null,0,0,0,{"$error":"#DIV/0!"},{"$error":"#DIV/0!"},{"$error":"#DIV/0!"},{"$error":"#DIV/0!"},{"$error":"#DIV/0!"},{"$error":"#DIV/0!"},{"$error":"#DIV/0!"},{"$f":"IF(A385=\"m\",VLOOKUP(P385,Berechnung_Male!$A$1:$D$42,AA385,TRUE),VLOOKUP(Eingabeblatt!P385,Berechnung_Female!$A$1:$D$42,AA385,TRUE))","v":{"$error":"#DIV/0!"}},{"$error":"#DIV/0!"},null,null,null,{"$error":"#DIV/0!"}]
[null,null,null,null,null,null,null,0,null,null,null,0,0,0,{"$error":"#DIV/0!"},{"$error":"#DIV/0!"},{"$error":"#DIV/0!"},{"$error":"#DIV/0!"},{"$error":"#DIV/0!"},{"$error":"#DIV/0!"},{"$error":"#DIV/0!"},{"$f":"IF(A386=\"m\",VLOOKUP(P386,Berechnung_Male!$A$1:$D$42,AA386,TRUE),VLOOKUP(Eingabeblatt!P386,Berechnung_Female!$A$1:$D$42,AA386,TRUE))","v":{"$error":"#DIV/0!"}},{"$error":"#DIV/0!"},null,null,null,{"$error":"#DIV/0!"}]
[null,null,null,null,null,null,null,0,null,null,null,0,0,0,{"$error":"#DIV/0!"},{"$error":"#DIV/0!"},{"$error":"#DIV/0!"},{"$error":"#DIV/0!"},{"$error":"#DIV/0!"},{"$error":"#DIV/0!"},{"$error":"#DIV/0!"},{"$f":"IF(A387=\"m\",VLOOKUP(P387,Berechnung_Male!$A$1:$D$42,AA387,TRUE),VLOOKUP(Eingabeblatt!P387,Berechnung_Female!$A$1:$D$42,AA387,TRUE))","v":{"$error":"#DIV/0!"}},{"$error":"#DIV/0!"},null,null,null,{"$error":"#DIV/0!"}]
[null,null,null,null,null,null,null,0,null,null,null,0,0,0,{"$error":"#DIV/0!"},{"$error":"#DIV/0!"},{"$error":"#DIV/0!"},{"$error":"#DIV/0!"},{"$error":"#DIV/0!"},{"$error":"#DIV/0!"},{"$error":"#DIV/0!"},{"$f":"IF(A388=\"m\",VLOOKUP(P388,Berechnung_Male!$A$1:$D$42,AA388,TRUE),VLOOKUP(Eingabeblatt!P388,Berechnung_Female!$A$1:$D$42,AA388,TRUE))","v":{"$error":"#DIV/0!"}},{"$error":"#DIV/0!"},null,null,null,{"$error":"#DIV/0!"}]
[null,null,null,null,null,null,null,0,null,null,null,0,0,0,{"$error":"#DIV/0!"},{"$error":"#DIV/0!"},{"$error":"#DIV/0!"},{"$error":"#DIV/0!"},{"$f":"IF(A389=\"m\",(IF(O389<12.8,1,IF(O389<13.3,2,IF(O389>14.8,5,IF(O389>14.3,4,3))))),(IF(O389<11,1,IF(O389<11.5,2,IF(O389>13,5,IF(O389>12.5,4,3))))))","v":{"$error":"#DIV/0!"}},{"$error":"#DIV/0!"},{"$error":"#DIV/0!"},{"$f":"IF(A389=\"m\",VLOOKUP(P389,Berechnung_Male!$A$1:$D$42,AA389,TRUE),VLOOKUP(Eingabeblatt!P389,Berechnung_Female!$A$1:$D$42,AA389,TRUE))","v":{"$error":"#DIV/0!"}},{"$error":"#DIV/0!"},null,null,null,{"$f":"IF(A389=\"m\",IF(O389<12.8,2,IF(O389<14.8,3,4)),IF(O389<11,2,IF(O389<13,3,4)))","v":{"$error":"#DIV/0!"}}]
[null,null,null,null,null,null,null,{"$f":"F390-G390","v":0},null,null,null,{"$f":"J390-K390","v":0},{"$f":"I390-L390","v":0},{"$f":"(B390-E390)/365.25","v":0},{"$f":"N390-P390","v":{"$error":"#DIV/0!"}},{"$f":"IF(A390=\"m\",(-9.236+(0.0002708*M390*L390)+(-0.001663*N390*M390)+(0.007216*N390*L390)+(0.02292*H390/I390*100)),(-9.376+(0.0001882*M390*L390)+(0.0022*N390*M390)+(0.005841*N390*L390)-(0.002658*N390*H390)+(0.07693*(H390/I390)*100)))","v":{"$error":"#DIV/0!"}},{"$f":"IF(R390=1,\"Früh / précoce\",IF(R390=2,\"Durchschnittlich / Normal\",\"Spät / Tardif\"))","v":{"$error":"#DIV/0!"}},{"$f":"IF(A390=\"m\",(IF(O390<12.8,1,IF(O390>14.8,3,2))),(IF(O390<11,1,IF(O390>13,3,2))))","v":{"$error":"#DIV/0!"}},{"$error":"#DIV/0!"},{"$f":"IF(S390=1,\"Früh / précoce\",IF(S390=2,\"Möglicherweise Früh / éventuellement précoce\", IF(S390=3,\"Durchschnittlich / Normal\",IF(S390=4,\"Möglicherweise spät / éventuellement tardif\",\"Spät / Tardif\"))))","v":{"$error":"#DIV/0!"}},{"$f":"I390+V390","v":{"$error":"#DIV/0!"}},{"$f":"IF(A390=\"m\",VLOOKUP(P390,Berechnung_Male!$A$1:$D$42,AA390,TRUE),VLOOKUP(Eingabeblatt!P390,Berechnung_Female!$A$1:$D$42,AA390,TRUE))","v":{"$error":"#DIV/0!"}},{"$f":"I390/U390","v":{"$error":"#DIV/0!"}},null,null,null,{"$error":"#DIV/0!"}]
[null,null,null,null,null,null,null,0,null,null,null,0,0,0,{"$error":"#DIV/0!"},{"$error":"#DIV/0!"},{"$error":"#DIV/0!"},{"$error":"#DIV/0!"},{"$error":"#DIV/0!"},{"$error":"#DIV/0!"},{"$error":"#DIV/0!"},{"$f":"IF(A391=\"m\",VLOOKUP(P391,Berechnung_Male!$A$1:$D$42,AA391,TRUE),VLOOKUP(Eingabeblatt!P391,Berechnung_Female!$A$1:$D$42,AA391,TRUE))","v":{"$error":"#DIV/0!"}},{"$error":"#DIV/0!"},null,null,null,{"$error":"#DIV/0!"}]
[null,null,null,null,null,null,null,0,null,null,null,0,0,0,{"$error":"#DIV/0!"},{"$error":"#DIV/0!"},{"$error":"#DIV/0!"},{"$error":"#DIV/0!"},{"$error":"#DIV/0!"},{"$error":"#DIV/0!"},{"$error":"#DIV/0!"},{"$f":"IF(A392=\"m\",VLOOKUP(P392,Berechnung_Male!$A$1:$D$42,AA392,TRUE),VLOOKUP(Eingabeblatt!P392,Berechnung_Female!$A$1:$D$42,AA392,TRUE))","v":{"$error":"#DIV/0!"}},{"$error":"#DIV/0!"},null,null,null,{"$error":"#DIV/0!"}]
[null,null,null,null,null,null,null,0,null,null,null,0,0,0,{"$error":"#DIV/0!"},{"$error":"#DIV/0!"},{"$error":"#DIV/0!"},{"$error":"#DIV/0!"},{"$error":"#DIV/0!"},{"$error":"#DIV/0!"},{"$error":"#DIV/0!"},{"$f":"IF(A393=\"m\",VLOOKUP(P393,Berechnung_Male!$A$1:$D$42,AA393,TRUE),VLOOKUP(Eingabeblatt!P393,Berechnung_Female!$A$1:$D$42,AA393,TRUE))","v":{"$error":"#DIV/0!"}},{"$error":"#DIV/0!"},null,null,null,{"$error":"#DIV/0!"}]
[null,null,null,null,null,null,null,0,null,null,null,0,0,0,{"$error":"#DIV/0!"},{"$error":"#DIV/0!"},{"$error":"#DIV/0!"},{"$error":"#DIV/0!"},{"$error":"#DIV/0!"},{"$error":"#DIV/0!"},{"$error":"#DIV/0!"},{"$f":"IF(A394=\"m\",VLOOKUP(P394,Berechnung_Male!$A$1:$D$42,AA394,TRUE),VLOOKUP(Eingabeblatt!P394,Berechnung_Female!$A$1:$D$42,AA394,TRUE))","v":{"$error":"#DIV/0!"}},{"$error":"#DIV/0!"},null,null,null,{"$error":"#DIV/0!"}]
[null,null,null,null,null,null,null,0,null,null,null,0,0,0,{"$error":"#DIV/0!"},{"$error":"#DIV/0!"},{"$error":"#DIV/0!"},{"$error":"#DIV/0!"},{"$error":"#DIV/0!"},{"$error":"#DIV/0!"},{"$error":"#DIV/0!"},{"$f":"IF(A395=\"m\",VLOOKUP(P395,Berechnung_Male!$A$1:$D$42,AA395,TRUE),VLOOKUP(Eingabeblatt!P395,Berechnung_Female!$A$1:$D$42,AA395,TRUE))","v":{"$error":"#DIV/0!"}},{"$error":"#DIV/0!"},null,null,null,{"$error":"#DIV/0!"}]
[null,null,null,null,null,null,null,0,null,null,null,0,0,0,{"$error":"#DIV/0!"},{"$error":"#DIV/0!"},{"$error":"#DIV/0!"},{"$error":"#DIV/0!"},{"$error":"#DIV/0!"},{"$error":"#DIV/0!"},{"$error":"#DIV/0!"},{"$f":"IF(A396=\"m\",VLOOKUP(P396,Berechnung_Male!$A$1:$D$42,AA396,TRUE),VLOOKUP(Eingabeblatt!P396,Berechnung_Female!$A$1:$D$42,AA396,TRUE))","v":{"$error":"#DIV/0!"}},{"$error":"#DIV/0!"},null,null,null,{"$error":"#DIV/0!"}]
[null,null,null,null,null,null,null,0,null,null,null,0,0,0,{"$error":"#DIV/0!"},{"$error":"#DIV/0!"},{"$error":"#DIV/0!"},{"$error":"#DIV/0!"},{"$error":"#DIV/0!"},{"$error":"#DIV/0!"},{"$error":"#DIV/0!"},{"$f":"IF(A397=\"m\",VLOOKUP(P397,Berechnung_Male!$A$1:$D$42,AA397,TRUE),VLOOKUP(Eingabeblatt!P397,Berechnung_Female!$A$1:$D$42,AA397,TRUE))","v":{"$error":"#DIV/0!"}},{"$error":"#DIV/0!"},null,null,null,{"$error":"#DIV/0!"}]
[null,null,null,null,null,null,null,0,null,null,null,0,0,0,{"$error":"#DIV/0!"},{"$error":"#DIV/0!"},{"$error":"#DIV/0!"},{"$error":"#DIV/0!"},{"$error":"#DIV/0!"},{"$error":"#DIV/0!"},{"$error":"#DIV/0!"},{"$f":"IF(A398=\"m\",VLOOKUP(P398,Berechnung_Male!$A$1:$D$42,AA398,TRUE),VLOOKUP(Eingabeblatt!P398,Berechnung_Female!$A$1:$D$42,AA398,TRUE))","v":{"$error":"#DIV/0!"}},{"$error":"#DIV/0!"},null,null,null,{"$error":"#DIV/0!"}]
[null,null,null,null,null,null,null,0,null,null,null,0,0,0,{"$error":"#DIV/0!"},{"$error":"#DIV/0!"},{"$error":"#DIV/0!"},{"$error":"#DIV/0!"},{"$error":"#DIV/0!"},{"$error":"#DIV/0!"},{"$error":"#DIV/0!"},{"$f":"IF(A399=\"m\",VLOOKUP(P399,Berechnung_Male!$A$1:$D$42,AA399,TRUE),VLOOKUP(Eingabeblatt!P399,Berechnung_Female!$A$1:$D$42,AA399,TRUE))","v":{"$error":"#DIV/0!"}},{"$error":"#DIV/0!"},null,null,null,{"$error":"#DIV/0!"}]
[null,null,null,null,null,null,null,0,null,null,null,0,0,0,{"$error":"#DIV/0!"},{"$error":"#DIV/0!"},{"$error":"#DIV/0!"},{"$error":"#DIV/0!"},{"$error":"#DIV/0!"},{"$error":"#DIV/0!"},{"$error":"#DIV/0!"},{"$f":"IF(A400=\"m\",VLOOKUP(P400,Berechnung_Male!$A$1:$D$42,AA400,TRUE),VLOOKUP(Eingabeblatt!P400,Berechnung_Female!$A$1:$D$42,AA400,TRUE))","v":{"$error":"#DIV/0!"}},{"$error":"#DIV/0!"},null,null,null,{"$error":"#DIV/0!"}]
[null,null,null,null,null,null,null,0,null,null,null,0,0,0,{"$error":"#DIV/0!"},{"$error":"#DIV/0!"},{"$error":"#DIV/0!"},{"$error":"#DIV/0!"},{"$error":"#DIV/0!"},{"$error":"#DIV/0!"},{"$error":"#DIV/0!"},{"$f":"IF(A401=\"m\",VLOOKUP(P401,Berechnung_Male!$A$1:$D$42,AA401,TRUE),VLOOKUP(Eingabeblatt!P401,Berechnung_Female!$A$1:$D$42,AA401,TRUE))","v":{"$error":"#DIV/0!"}},{"$error":"#DIV/0!"},null,null,null,{"$error":"#DIV/0!"}]
[null,null,null,null,null,null,null,0,null,null,null,0,0,0,{"$error":"#DIV/0!"},{"$error":"#DIV/0!"},{"$error":"#DIV/0!"},{"$error":"#DIV/0!"},{"$error":"#DIV/0!"},{"$error":"#DIV/0!"},{"$error":"#DIV/0!"},{"$f":"IF(A402=\"m\",VLOOKUP(P402,Berechnung_Male!$A$1:$D$42,AA402,TRUE),VLOOKUP(Eingabeblatt!P402,Berechnung_Female!$A$1:$D$42,AA402,TRUE))","v":{"$error":"#DIV/0!"}},{"$error":"#DIV/0!"},null,null,null,{"$error":"#DIV/0!"}]
[null,null,null,null,null,null,null,0,null,null,null,0,0,0,{"$error":"#DIV/0!"},{"$error":"#DIV/0!"},{"$error":"#DIV/0!"},{"$error":"#DIV/0!"},{"$error":"#DIV/0!"},{"$error":"#DIV/0!"},{"$error":"#DIV/0!"},{"$f":"IF(A403=\"m\",VLOOKUP(P403,Berechnung_Male!$A$1:$D$42,AA403,TRUE),VLOOKUP(Eingabeblatt!P403,Berechnung_Female!$A$1:$D$42,AA403,TRUE))","v":{"$error":"#DIV/0!"}},{"$error":"#DIV/0!"},null,null,null,{"$error":"#DIV/0!"}]
[null,null,null,null,null,null,null,0,null,null,null,0,0,0,{"$error":"#DIV/0!"},{"$error":"#DIV/0!"},{"$error":"#DIV/0!"},{"$error":"#DIV/0!"},{"$error":"#DIV/0!"},{"$error":"#DIV/0!"},{"$error":"#DIV/0!"},{"$f":"IF(A404=\"m\",VLOOKUP(P404,Berechnung_Male!$A$1:$D$42,AA404,TRUE),VLOOKUP(Eingabeblatt!P404,Berechnung_Female!$A$1:$D$42,AA404,TRUE))","v":{"$error":"#DIV/0!"}},{"$error":"#DIV/0!"},null,null,null,{"$error":"#DIV/0!"}]
[null,null,null,null,null,null,null,0,null,null,null,0,0,0,{"$error":"#DIV/0!"},{"$error":"#DIV/0!"},{"$error":"#DIV/0!"},{"$error":"#DIV/0!"},{"$error":"#DIV/0!"},{"$error":"#DIV/0!"},{"$error":"#DIV/0!"},{"$f":"IF(A405=\"m\",VLOOKUP(P405,Berechnung_Male!$A$1:$D$42,AA405,TRUE),VLOOKUP(Eingabeblatt!P405,Berechnung_Female!$A$1:$D$42,AA405,TRUE))","v":{"$error":"#DIV/0!"}},{"$error":"#DIV/0!"},null,null,null,{"$error":"#DIV/0!"}]
[null,null,null,null,null,null,null,0,null,null,null,0,0,0,{"$error":"#DIV/0!"},{"$error":"#DIV/0!"},{"$error":"#DIV/0!"},{"$error":"#DIV/0!"},{"$error":"#DIV/0!"},{"$error":"#DIV/0!"},{"$error":"#DIV/0!"},{"$f":"IF(A406=\"m\",VLOOKUP(P406,Berechnung_Male!$A$1:$D$42,AA406,TRUE),VLOOKUP(Eingabeblatt!P406,Berechnung_Female!$A$1:$D$42,AA406,TRUE))","v":{"$error":"#DIV/0!"}},{"$error":"#DIV/0!"},null,null,null,{"$error":"#DIV/0!"}]
[null,null,null,null,null,null,null,0,null,null,null,0,0,0,{"$error":"#DIV/0!"},{"$error":"#DIV/0!"},{"$error":"#DIV/0!"},{"$error":"#DIV/0!"},{"$error":"#DIV/0!"},{"$error":"#DIV/0!"},{"$error":"#DIV/0!"},{"$f":"IF(A407=\"m\",VLOOKUP(P407,Berechnung_Male!$A$1:$D$42,AA407,TRUE),VLOOKUP(Eingabeblatt!P407,Berechnung_Female!$A$1:$D$42,AA407,TRUE))","v":{"$error":"#DIV/0!"}},{"$error":"#DIV/0!"},null,null,null,{"$error":"#DIV/0!"}]
[null,null,null,null,null,null,null,0,null,null,null,0,0,0,{"$error":"#DIV/0!"},{"$error":"#DIV/0!"},{"$error":"#DIV/0!"},{"$error":"#DIV/0!"},{"$error":"#DIV/0!"},{"$error":"#DIV/0!"},{"$error":"#DIV/0!"},{"$f":"IF(A408=\"m\",VLOOKUP(P408,Berechnung_Male!$A$1:$D$42,AA408,TRUE),VLOOKUP(Eingabeblatt!P408,Berechnung_Female!$A$1:$D$42,AA408,TRUE))","v":{"$error":"#DIV/0!"}},{"$error":"#DIV/0!"},null,null,null,{"$error":"#DIV/0!"}]
[null,null,null,null,null,null,null,0,null,null,null,0,0,0,{"$error":"#DIV/0!"},{"$error":"#DIV/0!"},{"$error":"#DIV/0!"},{"$error":"#DIV/0!"},{"$error":"#DIV/0!"},{"$error":"#DIV/0!"},{"$error":"#DIV/0!"},{"$f":"IF(A409=\"m\",VLOOKUP(P409,Berechnung_Male!$A$1:$D$42,AA409,TRUE),VLOOKUP(Eingabeblatt!P409,Berechnung_Female!$A$1:$D$42,AA409,TRUE))","v":{"$error":"#DIV/0!"}},{"$error":"#DIV/0!"},null,null,null,{"$error":"#DIV/0!"}]
[null,null,null,null,null,null,null,0,null,null,null,0,0,0,{"$error":"#DIV/0!"},{"$error":"#DIV/0!"},{"$error":"#DIV/0!"},{"$error":"#DIV/0!"},{"$error":"#DIV/0!"},{"$error":"#DIV/0!"},{"$error":"#DIV/0!"},{"$f":"IF(A410=\"m\",VLOOKUP(P410,Berechnung_Male!$A$1:$D$42,AA410,TRUE),VLOOKUP(Eingabeblatt!P410,Berechnung_Female!$A$1:$D$42,AA410,TRUE))","v":{"$error":"#DIV/0!"}},{"$error":"#DIV/0!"},null,null,null,{"$error":"#DIV/0!"}]
[null,null,null,null,null,null,null,0,null,null,null,0,0,0,{"$error":"#DIV/0!"},{"$error":"#DIV/0!"},{"$error":"#DIV/0!"},{"$error":"#DIV/0!"},{"$error":"#DIV/0!"},{"$error":"#DIV/0!"},{"$error":"#DIV/0!"},{"$f":"IF(A411=\"m\",VLOOKUP(P411,Berechnung_Male!$A$1:$D$42,AA411,TRUE),VLOOKUP(Eingabeblatt!P411,Berechnung_Female!$A$1:$D$42,AA411,TRUE))","v":{"$error":"#DIV/0!"}},{"$error":"#DIV/0!"},null,null,null,{"$error":"#DIV/0!"}]
[null,null,null,null,null,null,null,0,null,null,null,0,0,0,{"$error":"#DIV/0!"},{"$error":"#DIV/0!"},{"$error":"#DIV/0!"},{"$error":"#DIV/0!"},{"$error":"#DIV/0!"},{"$error":"#DIV/0!"},{"$error":"#DIV/0!"},{"$f":"IF(A412=\"m\",VLOOKUP(P412,Berechnung_Male!$A$1:$D$42,AA412,TRUE),VLOOKUP(Eingabeblatt!P412,Berechnung_Female!$A$1:$D$42,AA412,TRUE))","v":{"$error":"#DIV/0!"}},{"$error":"#DIV/0!"},null,null,null,{"$error":"#DIV/0!"}]
[null,null,null,null,null,null,null,0,null,null,null,0,0,0,{"$error":"#DIV/0!"},{"$error":"#DIV/0!"},{"$error":"#DIV/0!"},{"$error":"#DIV/0!"},{"$error":"#DIV/0!"},{"$error":"#DIV/0!"},{"$error":"#DIV/0!"},{"$f":"IF(A413=\"m\",VLOOKUP(P413,Berechnung_Male!$A$1:$D$42,AA413,TRUE),VLOOKUP(Eingabeblatt!P413,Berechnung_Female!$A$1:$D$42,AA413,TRUE))","v":{"$error":"#DIV/0!"}},{"$error":"#DIV/0!"},null,null,null,{"$error":"#DIV/0!"}]
[null,null,null,null,null,null,null,0,null,null,null,0,0,0,{"$error":"#DIV/0!"},{"$error":"#DIV/0!"},{"$error":"#DIV/0!"},{"$error":"#DIV/0!"},{"$error":"#DIV/0!"},{"$error":"#DIV/0!"},{"$error":"#DIV/0!"},{"$f":"IF(A414=\"m\",VLOOKUP(P414,Berechnung_Male!$A$1:$D$42,AA414,TRUE),VLOOKUP(Eingabeblatt!P414,Berechnung_Female!$A$1:$D$42,AA414,TRUE))","v":{"$error":"#DIV/0!"}},{"$error":"#DIV/0!"},null,null,null,{"$error":"#DIV/0!"}]
[null,null,null,null,null,null,null,0,null,null,null,0,0,0,{"$error":"#DIV/0!"},{"$error":"#DIV/0!"},{"$error":"#DIV/0!"},{"$error":"#DIV/0!"},{"$error":"#DIV/0!"},{"$error":"#DIV/0!"},{"$error":"#DIV/0!"},{"$f":"IF(A415=\"m\",VLOOKUP(P415,Berechnung_Male!$A$1:$D$42,AA415,TRUE),VLOOKUP(Eingabeblatt!P415,Berechnung_Female!$A$1:$D$42,AA415,TRUE))","v":{"$error":"#DIV/0!"}},{"$error":"#DIV/0!"},null,null,null,{"$error":"#DIV/0!"}]
[null,null,null,null,null,null,null,0,null,null,null,0,0,0,{"$error":"#DIV/0!"},{"$error":"#DIV/0!"},{"$error":"#DIV/0!"},{"$error":"#DIV/0!"},{"$error":"#DIV/0!"},{"$error":"#DIV/0!"},{"$error":"#DIV/0!"},{"$f":"IF(A416=\"m\",VLOOKUP(P416,Berechnung_Male!$A$1:$D$42,AA416,TRUE),VLOOKUP(Eingabeblatt!P416,Berechnung_Female!$A$1:$D$42,AA416,TRUE))","v":{"$error":"#DIV/0!"}},{"$error":"#DIV/0!"},null,null,null,{"$error":"#DIV/0!"}]
[null,null,null,null,null,null,null,0,null,null,null,0,0,0,{"$error":"#DIV/0!"},{"$error":"#DIV/0!"},{"$error":"#DIV/0!"},{"$error":"#DIV/0!"},{"$error":"#DIV/0!"},{"$error":"#DIV/0!"},{"$error":"#DIV/0!"},{"$f":"IF(A417=\"m\",VLOOKUP(P417,Berechnung_Male!$A$1:$D$42,AA417,TRUE),VLOOKUP(Eingabeblatt!P417,Berechnung_Female!$A$1:$D$42,AA417,TRUE))","v":{"$error":"#DIV/0!"}},{"$error":"#DIV/0!"},null,null,null,{"$error":"#DIV/0!"}]
[null,null,null,null,null,null,null,0,null,null,null,0,0,0,{"$error":"#DIV/0!"},{"$error":"#DIV/0!"},{"$error":"#DIV/0!"},{"$error":"#DIV/0!"},{"$error":"#DIV/0!"},{"$error":"#DIV/0!"},{"$error":"#DIV/0!"},{"$f":"IF(A418=\"m\",VLOOKUP(P418,Berechnung_Male!$A$1:$D$42,AA418,TRUE),VLOOKUP(Eingabeblatt!P418,Berechnung_Female!$A$1:$D$42,AA418,TRUE))","v":{"$error":"#DIV/0!"}},{"$error":"#DIV/0!"},null,null,null,{"$error":"#DIV/0!"}]
[null,null,null,null,null,null,null,0,null,null,null,0,0,0,{"$error":"#DIV/0!"},{"$error":"#DIV/0!"},{"$error":"#DIV/0!"},{"$error":"#DIV/0!"},{"$error":"#DIV/0!"},{"$error":"#DIV/0!"},{"$error":"#DIV/0!"},{"$f":"IF(A419=\"m\",VLOOKUP(P419,Berechnung_Male!$A$1:$D$42,AA419,TRUE),VLOOKUP(Eingabeblatt!P419,Berechnung_Female!$A$1:$D$42,AA419,TRUE))","v":{"$error":"#DIV/0!"}},{"$error":"#DIV/0!"},null,null,null,{"$error":"#DIV/0!"}]
[null,null,null,null,null,null,null,0,null,null,null,0,0,0,{"$error":"#DIV/0!"},{"$error":"#DIV/0!"},{"$error":"#DIV/0!"},{"$error":"#DIV/0!"},{"$error":"#DIV/0!"},{"$error":"#DIV/0!"},{"$error":"#DIV/0!"},{"$f":"IF(A420=\"m\",VLOOKUP(P420,Berechnung_Male!$A$1:$D$42,AA420,TRUE),VLOOKUP(Eingabeblatt!P420,Berechnung_Female!$A$1:$D$42,AA420,TRUE))","v":{"$error":"#DIV/0!"}},{"$error":"#DIV/0!"},null,null,null,{"$error":"#DIV/0!"}]
[null,null,null,null,null,null,null,0,null,null,null,0,0,0,{"$error":"#DIV/0!"},{"$error":"#DIV/0!"},{"$error":"#DIV/0!"},{"$error":"#DIV/0!"},{"$error":"#DIV/0!"},{"$error":"#DIV/0!"},{"$error":"#DIV/0!"},{"$f":"IF(A421=\"m\",VLOOKUP(P421,Berechnung_Male!$A$1:$D$42,AA421,TRUE),VLOOKUP(Eingabeblatt!P421,Berechnung_Female!$A$1:$D$42,AA421,TRUE))","v":{"$error":"#DIV/0!"}},{"$error":"#DIV/0!"},null,null,null,{"$error":"#DIV/0!"}]
[null,null,null,null,null,null,null,0,null,null,null,0,0,0,{"$error":"#DIV/0!"},{"$error":"#DIV/0!"},{"$error":"#DIV/0!"},{"$error":"#DIV/0!"},{"$error":"#DIV/0!"},{"$error":"#DIV/0!"},{"$error":"#DIV/0!"},{"$f":"IF(A422=\"m\",VLOOKUP(P422,Berechnung_Male!$A$1:$D$42,AA422,TRUE),VLOOKUP(Eingabeblatt!P422,Berechnung_Female!$A$1:$D$42,AA422,TRUE))","v":{"$error":"#DIV/0!"}},{"$error":"#DIV/0!"},null,null,null,{"$error":"#DIV/0!"}]
[null,null,null,null,null,null,null,0,null,null,null,0,0,0,{"$error":"#DIV/0!"},{"$error":"#DIV/0!"},{"$error":"#DIV/0!"},{"$error":"#DIV/0!"},{"$error":"#DIV/0!"},{"$error":"#DIV/0!"},{"$error":"#DIV/0!"},{"$f":"IF(A423=\"m\",VLOOKUP(P423,Berechnung_Male!$A$1:$D$42,AA423,TRUE),VLOOKUP(Eingabeblatt!P423,Berechnung_Female!$A$1:$D$42,AA423,TRUE))","v":{"$error":"#DIV/0!"}},{"$error":"#DIV/0!"},null,null,null,{"$error":"#DIV/0!"}]
[null,null,null,null,null,null,null,0,null,null,null,0,0,0,{"$error":"#DIV/0!"},{"$error":"#DIV/0!"},{"$error":"#DIV/0!"},{"$error":"#DIV/0!"},{"$error":"#DIV/0!"},{"$error":"#DIV/0!"},{"$error":"#DIV/0!"},{"$f":"IF(A424=\"m\",VLOOKUP(P424,Berechnung_Male!$A$1:$D$42,AA424,TRUE),VLOOKUP(Eingabeblatt!P424,Berechnung_Female!$A$1:$D$42,AA424,TRUE))","v":{"$error":"#DIV/0!"}},{"$error":"#DIV/0!"},null,null,null,{"$error":"#DIV/0!"}]
[null,null,null,null,null,null,null,0,null,null,null,0,0,0,{"$error":"#DIV/0!"},{"$error":"#DIV/0!"},{"$error":"#DIV/0!"},{"$error":"#DIV/0!"},{"$error":"#DIV/0!"},{"$error":"#DIV/0!"},{"$error":"#DIV/0!"},{"$f":"IF(A425=\"m\",VLOOKUP(P425,Berechnung_Male!$A$1:$D$42,AA425,TRUE),VLOOKUP(Eingabeblatt!P425,Berechnung_Female!$A$1:$D$42,AA425,TRUE))","v":{"$error":"#DIV/0!"}},{"$error":"#DIV/0!"},null,null,null,{"$error":"#DIV/0!"}]
[null,null,null,null,null,null,null,0,null,null,null,0,0,0,{"$error":"#DIV/0!"},{"$error":"#DIV/0!"},{"$error":"#DIV/0!"},{"$error":"#DIV/0!"},{"$error":"#DIV/0!"},{"$error":"#DIV/0!"},{"$error":"#DIV/0!"},{"$f":"IF(A426=\"m\",VLOOKUP(P426,Berechnung_Male!$A$1:$D$42,AA426,TRUE),VLOOKUP(Eingabeblatt!P426,Berechnung_Female!$A$1:$D$42,AA426,TRUE))","v":{"$error":"#DIV/0!"}},{"$error":"#DIV/0!"},null,null,null,{"$error":"#DIV/0!"}]
[null,null,null,null,null,null,null,0,null,null,null,0,0,0,{"$error":"#DIV/0!"},{"$error":"#DIV/0!"},{"$error":"#DIV/0!"},{"$error":"#DIV/0!"},{"$error":"#DIV/0!"},{"$error":"#DIV/0!"},{"$error":"#DIV/0!"},{"$f":"IF(A427=\"m\",VLOOKUP(P427,Berechnung_Male!$A$1:$D$42,AA427,TRUE),VLOOKUP(Eingabeblatt!P427,Berechnung_Female!$A$1:$D$42,AA427,TRUE))","v":{"$error":"#DIV/0!"}},{"$error":"#DIV/0!"},null,null,null,{"$error":"#DIV/0!"}]
[null,null,null,null,null,null,null,0,null,null,null,0,0,0,{"$error":"#DIV/0!"},{"$error":"#DIV/0!"},{"$error":"#DIV/0!"},{"$error":"#DIV/0!"},{"$error":"#DIV/0!"},{"$error":"#DIV/0!"},{"$error":"#DIV/0!"},{"$f":"IF(A428=\"m\",VLOOKUP(P428,Berechnung_Male!$A$1:$D$42,AA428,TRUE),VLOOKUP(Eingabeblatt!P428,Berechnung_Female!$A$1:$D$42,AA428,TRUE))","v":{"$error":"#DIV/0!"}},{"$error":"#DIV/0!"},null,null,null,{"$error":"#DIV/0!"}]
[null,null,null,null,null,null,null,0,null,null,null,0,0,0,{"$error":"#DIV/0!"},{"$error":"#DIV/0!"},{"$error":"#DIV/0!"},{"$error":"#DIV/0!"},{"$error":"#DIV/0!"},{"$error":"#DIV/0!"},{"$error":"#DIV/0!"},{"$f":"IF(A429=\"m\",VLOOKUP(P429,Berechnung_Male!$A$1:$D$42,AA429,TRUE),VLOOKUP(Eingabeblatt!P429,Berechnung_Female!$A$1:$D$42,AA429,TRUE))","v":{"$error":"#DIV/0!"}},{"$error":"#DIV/0!"},null,null,null,{"$error":"#DIV/0!"}]
[null,null,null,null,null,null,null,0,null,null,null,0,0,0,{"$error":"#DIV/0!"},{"$error":"#DIV/0!"},{"$error":"#DIV/0!"},{"$error":"#DIV/0!"},{"$error":"#DIV/0!"},{"$error":"#DIV/0!"},{"$error":"#DIV/0!"},{"$f":"IF(A430=\"m\",VLOOKUP(P430,Berechnung_Male!$A$1:$D$42,AA430,TRUE),VLOOKUP(Eingabeblatt!P430,Berechnung_Female!$A$1:$D$42,AA430,TRUE))","v":{"$error":"#DIV/0!"}},{"$error":"#DIV/0!"},null,null,null,{"$error":"#DIV/0!"}]
[null,null,null,null,null,null,null,0,null,null,null,0,0,0,{"$error":"#DIV/0!"},{"$error":"#DIV/0!"},{"$error":"#DIV/0!"},{"$error":"#DIV/0!"},{"$error":"#DIV/0!"},{"$error":"#DIV/0!"},{"$error":"#DIV/0!"},{"$f":"IF(A431=\"m\",VLOOKUP(P431,Berechnung_Male!$A$1:$D$42,AA431,TRUE),VLOOKUP(Eingabeblatt!P431,Berechnung_Female!$A$1:$D$42,AA431,TRUE))","v":{"$error":"#DIV/0!"}},{"$error":"#DIV/0!"},null,null,null,{"$error":"#DIV/0!"}]
[null,null,null,null,null,null,null,0,null,null,null,0,0,0,{"$error":"#DIV/0!"},{"$error":"#DIV/0!"},{"$error":"#DIV/0!"},{"$error":"#DIV/0!"},{"$error":"#DIV/0!"},{"$error":"#DIV/0!"},{"$error":"#DIV/0!"},{"$f":"IF(A432=\"m\",VLOOKUP(P432,Berechnung_Male!$A$1:$D$42,AA432,TRUE),VLOOKUP(Eingabeblatt!P432,Berechnung_Female!$A$1:$D$42,AA432,TRUE))","v":{"$error":"#DIV/0!"}},{"$error":"#DIV/0!"},null,null,null,{"$error":"#DIV/0!"}]
[null,null,null,null,null,null,null,0,null,null,null,0,0,0,{"$error":"#DIV/0!"},{"$error":"#DIV/0!"},{"$error":"#DIV/0!"},{"$error":"#DIV/0!"},{"$error":"#DIV/0!"},{"$error":"#DIV/0!"},{"$error":"#DIV/0!"},{"$f":"IF(A433=\"m\",VLOOKUP(P433,Berechnung_Male!$A$1:$D$42,AA433,TRUE),VLOOKUP(Eingabeblatt!P433,Berechnung_Female!$A$1:$D$42,AA433,TRUE))","v":{"$error":"#DIV/0!"}},{"$error":"#DIV/0!"},null,null,null,{"$error":"#DIV/0!"}]
[null,null,null,null,null,null,null,0,null,null,null,0,0,0,{"$error":"#DIV/0!"},{"$error":"#DIV/0!"},{"$error":"#DIV/0!"},{"$error":"#DIV/0!"},{"$error":"#DIV/0!"},{"$error":"#DIV/0!"},{"$error":"#DIV/0!"},{"$f":"IF(A434=\"m\",VLOOKUP(P434,Berechnung_Male!$A$1:$D$42,AA434,TRUE),VLOOKUP(Eingabeblatt!P434,Berechnung_Female!$A$1:$D$42,AA434,TRUE))","v":{"$error":"#DIV/0!"}},{"$error":"#DIV/0!"},null,null,null,{"$error":"#DIV/0!"}]
[null,null,null,null,null,null,null,0,null,null,null,0,0,0,{"$error":"#DIV/0!"},{"$error":"#DIV/0!"},{"$error":"#DIV/0!"},{"$error":"#DIV/0!"},{"$error":"#DIV/0!"},{"$error":"#DIV/0!"},{"$error":"#DIV/0!"},{"$f":"IF(A435=\"m\",VLOOKUP(P435,Berechnung_Male!$A$1:$D$42,AA435,TRUE),VLOOKUP(Eingabeblatt!P435,Berechnung_Female!$A$1:$D$42,AA435,TRUE))","v":{"$error":"#DIV/0!"}},{"$error":"#DIV/0!"},null,null,null,{"$error":"#DIV/0!"}]
[null,null,null,null,null,null,null,0,null,null,null,0,0,0,{"$error":"#DIV/0!"},{"$error":"#DIV/0!"},{"$error":"#DIV/0!"},{"$error":"#DIV/0!"},{"$error":"#DIV/0!"},{"$error":"#DIV/0!"},{"$error":"#DIV/0!"},{"$f":"IF(A436=\"m\",VLOOKUP(P436,Berechnung_Male!$A$1:$D$42,AA436,TRUE),VLOOKUP(Eingabeblatt!P436,Berechnung_Female!$A$1:$D$42,AA436,TRUE))","v":{"$error":"#DIV/0!"}},{"$error":"#DIV/0!"},null,null,null,{"$error":"#DIV/0!"}]
[null,null,null,null,null,null,null,0,null,null,null,0,0,0,{"$error":"#DIV/0!"},{"$error":"#DIV/0!"},{"$error":"#DIV/0!"},{"$error":"#DIV/0!"},{"$error":"#DIV/0!"},{"$error":"#DIV/0!"},{"$error":"#DIV/0!"},{"$f":"IF(A437=\"m\",VLOOKUP(P437,Berechnung_Male!$A$1:$D$42,AA437,TRUE),VLOOKUP(Eingabeblatt!P437,Berechnung_Female!$A$1:$D$42,AA437,TRUE))","v":{"$error":"#DIV/0!"}},{"$error":"#DIV/0!"},null,null,null,{"$error":"#DIV/0!"}]
[null,null,null,null,null,null,null,0,null,null,null,0,0,0,{"$error":"#DIV/0!"},{"$error":"#DIV/0!"},{"$error":"#DIV/0!"},{"$error":"#DIV/0!"},{"$error":"#DIV/0!"},{"$error":"#DIV/0!"},{"$error":"#DIV/0!"},{"$f":"IF(A438=\"m\",VLOOKUP(P438,Berechnung_Male!$A$1:$D$42,AA438,TRUE),VLOOKUP(Eingabeblatt!P438,Berechnung_Female!$A$1:$D$42,AA438,TRUE))","v":{"$error":"#DIV/0!"}},{"$error":"#DIV/0!"},null,null,null,{"$error":"#DIV/0!"}]
[null,null,null,null,null,null,null,0,null,null,null,0,0,0,{"$error":"#DIV/0!"},{"$error":"#DIV/0!"},{"$error":"#DIV/0!"},{"$error":"#DIV/0!"},{"$error":"#DIV/0!"},{"$error":"#DIV/0!"},{"$error":"#DIV/0!"},{"$f":"IF(A439=\"m\",VLOOKUP(P439,Berechnung_Male!$A$1:$D$42,AA439,TRUE),VLOOKUP(Eingabeblatt!P439,Berechnung_Female!$A$1:$D$42,AA439,TRUE))","v":{"$error":"#DIV/0!"}},{"$error":"#DIV/0!"},null,null,null,{"$error":"#DIV/0!"}]
[null,null,null,null,null,null,null,0,null,null,null,0,0,0,{"$error":"#DIV/0!"},{"$error":"#DIV/0!"},{"$error":"#DIV/0!"},{"$error":"#DIV/0!"},{"$error":"#DIV/0!"},{"$error":"#DIV/0!"},{"$error":"#DIV/0!"},{"$f":"IF(A440=\"m\",VLOOKUP(P440,Berechnung_Male!$A$1:$D$42,AA440,TRUE),VLOOKUP(Eingabeblatt!P440,Berechnung_Female!$A$1:$D$42,AA440,TRUE))","v":{"$error":"#DIV/0!"}},{"$error":"#DIV/0!"},null,null,null,{"$error":"#DIV/0!"}]
[null,null,null,null,null,null,null,0,null,null,null,0,0,0,{"$error":"#DIV/0!"},{"$error":"#DIV/0!"},{"$error":"#DIV/0!"},{"$error":"#DIV/0!"},{"$error":"#DIV/0!"},{"$error":"#DIV/0!"},{"$error":"#DIV/0!"},{"$f":"IF(A441=\"m\",VLOOKUP(P441,Berechnung_Male!$A$1:$D$42,AA441,TRUE),VLOOKUP(Eingabeblatt!P441,Berechnung_Female!$A$1:$D$42,AA441,TRUE))","v":{"$error":"#DIV/0!"}},{"$error":"#DIV/0!"},null,null,null,{"$error":"#DIV/0!"}]
[null,null,null,null,null,null,null,0,null,null,null,0,0,0,{"$error":"#DIV/0!"},{"$error":"#DIV/0!"},{"$error":"#DIV/0!"},{"$error":"#DIV/0!"},{"$error":"#DIV/0!"},{"$error":"#DIV/0!"},{"$error":"#DIV/0!"},{"$f":"IF(A442=\"m\",VLOOKUP(P442,Berechnung_Male!$A$1:$D$42,AA442,TRUE),VLOOKUP(Eingabeblatt!P442,Berechnung_Female!$A$1:$D$42,AA442,TRUE))","v":{"$error":"#DIV/0!"}},{"$error":"#DIV/0!"},null,null,null,{"$error":"#DIV/0!"}]
[null,null,null,null,null,null,null,0,null,null,null,0,0,0,{"$error":"#DIV/0!"},{"$error":"#DIV/0!"},{"$error":"#DIV/0!"},{"$error":"#DIV/0!"},{"$error":"#DIV/0!"},{"$error":"#DIV/0!"},{"$error":"#DIV/0!"},{"$f":"IF(A443=\"m\",VLOOKUP(P443,Berechnung_Male!$A$1:$D$42,AA443,TRUE),VLOOKUP(Eingabeblatt!P443,Berechnung_Female!$A$1:$D$42,AA443,TRUE))","v":{"$error":"#DIV/0!"}},{"$error":"#DIV/0!"},null,null,null,{"$error":"#DIV/0!"}]
[null,null,null,null,null,null,null,0,null,null,null,0,0,0,{"$error":"#DIV/0!"},{"$error":"#DIV/0!"},{"$error":"#DIV/0!"},{"$error":"#DIV/0!"},{"$error":"#DIV/0!"},{"$error":"#DIV/0!"},{"$error":"#DIV/0!"},{"$f":"IF(A444=\"m\",VLOOKUP(P444,Berechnung_Male!$A$1:$D$42,AA444,TRUE),VLOOKUP(Eingabeblatt!P444,Berechnung_Female!$A$1:$D$42,AA444,TRUE))","v":{"$error":"#DIV/0!"}},{"$error":"#DIV/0!"},null,null,null,{"$error":"#DIV/0!"}]
[null,null,null,null,null,null,null,0,null,null,null,0,0,0,{"$error":"#DIV/0!"},{"$error":"#DIV/0!"},{"$error":"#DIV/0!"},{"$error":"#DIV/0!"},{"$error":"#DIV/0!"},{"$error":"#DIV/0!"},{"$error":"#DIV/0!"},{"$f":"IF(A445=\"m\",VLOOKUP(P445,Berechnung_Male!$A$1:$D$42,AA445,TRUE),VLOOKUP(Eingabeblatt!P445,Berechnung_Female!$A$1:$D$42,AA445,TRUE))","v":{"$error":"#DIV/0!"}},{"$error":"#DIV/0!"},null,null,null,{"$error":"#DIV/0!"}]
[null,null,null,null,null,null,null,0,null,null,null,0,0,0,{"$error":"#DIV/0!"},{"$error":"#DIV/0!"},{"$error":"#DIV/0!"},{"$error":"#DIV/0!"},{"$error":"#DIV/0!"},{"$error":"#DIV/0!"},{"$error":"#DIV/0!"},{"$f":"IF(A446=\"m\",VLOOKUP(P446,Berechnung_Male!$A$1:$D$42,AA446,TRUE),VLOOKUP(Eingabeblatt!P446,Berechnung_Female!$A$1:$D$42,AA446,TRUE))","v":{"$error":"#DIV/0!"}},{"$error":"#DIV/0!"},null,null,null,{"$error":"#DIV/0!"}]
[null,null,null,null,null,null,null,0,null,null,null,0,0,0,{"$error":"#DIV/0!"},{"$error":"#DIV/0!"},{"$error":"#DIV/0!"},{"$error":"#DIV/0!"},{"$error":"#DIV/0!"},{"$error":"#DIV/0!"},{"$error":"#DIV/0!"},{"$f":"IF(A447=\"m\",VLOOKUP(P447,Berechnung_Male!$A$1:$D$42,AA447,TRUE),VLOOKUP(Eingabeblatt!P447,Berechnung_Female!$A$1:$D$42,AA447,TRUE))","v":{"$error":"#DIV/0!"}},{"$error":"#DIV/0!"},null,null,null,{"$error":"#DIV/0!"}]
[null,null,null,null,null,null,null,0,null,null,null,0,0,0,{"$error":"#DIV/0!"},{"$error":"#DIV/0!"},{"$error":"#DIV/0!"},{"$error":"#DIV/0!"},{"$error":"#DIV/0!"},{"$error":"#DIV/0!"},{"$error":"#DIV/0!"},{"$f":"IF(A448=\"m\",VLOOKUP(P448,Berechnung_Male!$A$1:$D$42,AA448,TRUE),VLOOKUP(Eingabeblatt!P448,Berechnung_Female!$A$1:$D$42,AA448,TRUE))","v":{"$error":"#DIV/0!"}},{"$error":"#DIV/0!"},null,null,null,{"$error":"#DIV/0!"}]
[null,null,null,null,null,null,null,0,null,null,null,0,0,0,{"$error":"#DIV/0!"},{"$error":"#DIV/0!"},{"$error":"#DIV/0!"},{"$error":"#DIV/0!"},{"$error":"#DIV/0!"},{"$error":"#DIV/0!"},{"$error":"#DIV/0!"},{"$f":"IF(A449=\"m\",VLOOKUP(P449,Berechnung_Male!$A$1:$D$42,AA449,TRUE),VLOOKUP(Eingabeblatt!P449,Berechnung_Female!$A$1:$D$42,AA449,TRUE))","v":{"$error":"#DIV/0!"}},{"$error":"#DIV/0!"},null,null,null,{"$error":"#DIV/0!"}]
[null,null,null,null,null,null,null,0,null,null,null,0,0,0,{"$error":"#DIV/0!"},{"$error":"#DIV/0!"},{"$error":"#DIV/0!"},{"$error":"#DIV/0!"},{"$error":"#DIV/0!"},{"$error":"#DIV/0!"},{"$error":"#DIV/0!"},{"$f":"IF(A450=\"m\",VLOOKUP(P450,Berechnung_Male!$A$1:$D$42,AA450,TRUE),VLOOKUP(Eingabeblatt!P450,Berechnung_Female!$A$1:$D$42,AA450,TRUE))","v":{"$error":"#DIV/0!"}},{"$error":"#DIV/0!"},null,null,null,{"$error":"#DIV/0!"}]
[null,null,null,null,null,null,null,0,null,null,null,0,0,0,{"$error":"#DIV/0!"},{"$error":"#DIV/0!"},{"$error":"#DIV/0!"},{"$error":"#DIV/0!"},{"$error":"#DIV/0!"},{"$error":"#DIV/0!"},{"$error":"#DIV/0!"},{"$f":"IF(A451=\"m\",VLOOKUP(P451,Berechnung_Male!$A$1:$D$42,AA451,TRUE),VLOOKUP(Eingabeblatt!P451,Berechnung_Female!$A$1:$D$42,AA451,TRUE))","v":{"$error":"#DIV/0!"}},{"$error":"#DIV/0!"},null,null,null,{"$error":"#DIV/0!"}]
[null,null,null,null,null,null,null,0,null,null,null,0,0,0,{"$error":"#DIV/0!"},{"$error":"#DIV/0!"},{"$error":"#DIV/0!"},{"$error":"#DIV/0!"},{"$error":"#DIV/0!"},{"$error":"#DIV/0!"},{"$error":"#DIV/0!"},{"$f":"IF(A452=\"m\",VLOOKUP(P452,Berechnung_Male!$A$1:$D$42,AA452,TRUE),VLOOKUP(Eingabeblatt!P452,Berechnung_Female!$A$1:$D$42,AA452,TRUE))","v":{"$error":"#DIV/0!"}},{"$error":"#DIV/0!"},null,null,null,{"$error":"#DIV/0!"}]
[null,null,null,null,null,null,null,0,null,null,null,0,0,0,{"$error":"#DIV/0!"},{"$error":"#DIV/0!"},{"$error":"#DIV/0!"},{"$error":"#DIV/0!"},{"$f":"IF(A453=\"m\",(IF(O453<12.8,1,IF(O453<13.3,2,IF(O453>14.8,5,IF(O453>14.3,4,3))))),(IF(O453<11,1,IF(O453<11.5,2,IF(O453>13,5,IF(O453>12.5,4,3))))))","v":{"$error":"#DIV/0!"}},{"$error":"#DIV/0!"},{"$error":"#DIV/0!"},{"$f":"IF(A453=\"m\",VLOOKUP(P453,Berechnung_Male!$A$1:$D$42,AA453,TRUE),VLOOKUP(Eingabeblatt!P453,Berechnung_Female!$A$1:$D$42,AA453,TRUE))","v":{"$error":"#DIV/0!"}},{"$error":"#DIV/0!"},null,null,null,{"$f":"IF(A453=\"m\",IF(O453<12.8,2,IF(O453<14.8,3,4)),IF(O453<11,2,IF(O453<13,3,4)))","v":{"$error":"#DIV/0!"}}]
[null,null,null,null,null,null,null,{"$f":"F454-G454","v":0},null,null,null,{"$f":"J454-K454","v":0},{"$f":"I454-L454","v":0},{"$f":"(B454-E454)/365.25","v":0},{"$f":"N454-P454","v":{"$error":"#DIV/0!"}},{"$f":"IF(A454=\"m\",(-9.236+(0.0002708*M454*L454)+(-0.001663*N454*M454)+(0.007216*N454*L454)+(0.02292*H454/I454*100)),(-9.376+(0.0001882*M454*L454)+(0.0022*N454*M454)+(0.005841*N454*L454)-(0.002658*N454*H454)+(0.07693*(H454/I454)*100)))","v":{"$error":"#DIV/0!"}},{"$f":"IF(R454=1,\"Früh / précoce\",IF(R454=2,\"Durchschnittlich / Normal\",\"Spät / Tardif\"))","v":{"$error":"#DIV/0!"}},{"$f":"IF(A454=\"m\",(IF(O454<12.8,1,IF(O454>14.8,3,2))),(IF(O454<11,1,IF(O454>13,3,2))))","v":{"$error":"#DIV/0!"}},{"$error":"#DIV/0!"},{"$f":"IF(S454=1,\"Früh / précoce\",IF(S454=2,\"Möglicherweise Früh / éventuellement précoce\", IF(S454=3,\"Durchschnittlich / Normal\",IF(S454=4,\"Möglicherweise spät / éventuellement tardif\",\"Spät / Tardif\"))))","v":{"$error":"#DIV/0!"}},{"$f":"I454+V454","v":{"$error":"#DIV/0!"}},{"$f":"IF(A454=\"m\",VLOOKUP(P454,Berechnung_Male!$A$1:$D$42,AA454,TRUE),VLOOKUP(Eingabeblatt!P454,Berechnung_Female!$A$1:$D$42,AA454,TRUE))","v":{"$error":"#DIV/0!"}},{"$f":"I454/U454","v":{"$error":"#DIV/0!"}},null,null,null,{"$error":"#DIV/0!"}]
[null,null,null,null,null,null,null,0,null,null,null,0,0,0,{"$error":"#DIV/0!"},{"$error":"#DIV/0!"},{"$error":"#DIV/0!"},{"$error":"#DIV/0!"},{"$error":"#DIV/0!"},{"$error":"#DIV/0!"},{"$error":"#DIV/0!"},{"$f":"IF(A455=\"m\",VLOOKUP(P455,Berechnung_Male!$A$1:$D$42,AA455,TRUE),VLOOKUP(Eingabeblatt!P455,Berechnung_Female!$A$1:$D$42,AA455,TRUE))","v":{"$error":"#DIV/0!"}},{"$error":"#DIV/0!"},null,null,null,{"$error":"#DIV/0!"}]
[null,null,null,null,null,null,null,0,null,null,null,0,0,0,{"$error":"#DIV/0!"},{"$error":"#DIV/0!"},{"$error":"#DIV/0!"},{"$error":"#DIV/0!"},{"$error":"#DIV/0!"},{"$error":"#DIV/0!"},{"$error":"#DIV/0!"},{"$f":"IF(A456=\"m\",VLOOKUP(P456,Berechnung_Male!$A$1:$D$42,AA456,TRUE),VLOOKUP(Eingabeblatt!P456,Berechnung_Female!$A$1:$D$42,AA456,TRUE))","v":{"$error":"#DIV/0!"}},{"$error":"#DIV/0!"},null,null,null,{"$error":"#DIV/0!"}]
[null,null,null,null,null,null,null,0,null,null,null,0,0,0,{"$error":"#DIV/0!"},{"$error":"#DIV/0!"},{"$error":"#DIV/0!"},{"$error":"#DIV/0!"},{"$error":"#DIV/0!"},{"$error":"#DIV/0!"},{"$error":"#DIV/0!"},{"$f":"IF(A457=\"m\",VLOOKUP(P457,Berechnung_Male!$A$1:$D$42,AA457,TRUE),VLOOKUP(Eingabeblatt!P457,Berechnung_Female!$A$1:$D$42,AA457,TRUE))","v":{"$error":"#DIV/0!"}},{"$error":"#DIV/0!"},null,null,null,{"$error":"#DIV/0!"}]
[null,null,null,null,null,null,null,0,null,null,null,0,0,0,{"$error":"#DIV/0!"},{"$error":"#DIV/0!"},{"$error":"#DIV/0!"},{"$error":"#DIV/0!"},{"$error":"#DIV/0!"},{"$error":"#DIV/0!"},{"$error":"#DIV/0!"},{"$f":"IF(A458=\"m\",VLOOKUP(P458,Berechnung_Male!$A$1:$D$42,AA458,TRUE),VLOOKUP(Eingabeblatt!P458,Berechnung_Female!$A$1:$D$42,AA458,TRUE))","v":{"$error":"#DIV/0!"}},{"$error":"#DIV/0!"},null,null,null,{"$error":"#DIV/0!"}]
[null,null,null,null,null,null,null,0,null,null,null,0,0,0,{"$error":"#DIV/0!"},{"$error":"#DIV/0!"},{"$error":"#DIV/0!"},{"$error":"#DIV/0!"},{"$error":"#DIV/0!"},{"$error":"#DIV/0!"},{"$error":"#DIV/0!"},{"$f":"IF(A459=\"m\",VLOOKUP(P459,Berechnung_Male!$A$1:$D$42,AA459,TRUE),VLOOKUP(Eingabeblatt!P459,Berechnung_Female!$A$1:$D$42,AA459,TRUE))","v":{"$error":"#DIV/0!"}},{"$error":"#DIV/0!"},null,null,null,{"$error":"#DIV/0!"}]
[null,null,null,null,null,null,null,0,null,null,null,0,0,0,{"$error":"#DIV/0!"},{"$error":"#DIV/0!"},{"$error":"#DIV/0!"},{"$error":"#DIV/0!"},{"$error":"#DIV/0!"},{"$error":"#DIV/0!"},{"$error":"#DIV/0!"},{"$f":"IF(A460=\"m\",VLOOKUP(P460,Berechnung_Male!$A$1:$D$42,AA460,TRUE),VLOOKUP(Eingabeblatt!P460,Berechnung_Female!$A$1:$D$42,AA460,TRUE))","v":{"$error":"#DIV/0!"}},{"$error":"#DIV/0!"},null,null,null,{"$error":"#DIV/0!"}]
[null,null,null,null,null,null,null,0,null,null,null,0,0,0,{"$error":"#DIV/0!"},{"$error":"#DIV/0!"},{"$error":"#DIV/0!"},{"$error":"#DIV/0!"},{"$error":"#DIV/0!"},{"$error":"#DIV/0!"},{"$error":"#DIV/0!"},{"$f":"IF(A461=\"m\",VLOOKUP(P461,Berechnung_Male!$A$1:$D$42,AA461,TRUE),VLOOKUP(Eingabeblatt!P461,Berechnung_Female!$A$1:$D$42,AA461,TRUE))","v":{"$error":"#DIV/0!"}},{"$error":"#DIV/0!"},null,null,null,{"$error":"#DIV/0!"}]
[null,null,null,null,null,null,null,0,null,null,null,0,0,0,{"$error":"#DIV/0!"},{"$error":"#DIV/0!"},{"$error":"#DIV/0!"},{"$error":"#DIV/0!"},{"$error":"#DIV/0!"},{"$error":"#DIV/0!"},{"$error":"#DIV/0!"},{"$f":"IF(A462=\"m\",VLOOKUP(P462,Berechnung_Male!$A$1:$D$42,AA462,TRUE),VLOOKUP(Eingabeblatt!P462,Berechnung_Female!$A$1:$D$42,AA462,TRUE))","v":{"$error":"#DIV/0!"}},{"$error":"#DIV/0!"},null,null,null,{"$error":"#DIV/0!"}]
[null,null,null,null,null,null,null,0,null,null,null,0,0,0,{"$error":"#DIV/0!"},{"$error":"#DIV/0!"},{"$error":"#DIV/0!"},{"$error":"#DIV/0!"},{"$error":"#DIV/0!"},{"$error":"#DIV/0!"},{"$error":"#DIV/0!"},{"$f":"IF(A463=\"m\",VLOOKUP(P463,Berechnung_Male!$A$1:$D$42,AA463,TRUE),VLOOKUP(Eingabeblatt!P463,Berechnung_Female!$A$1:$D$42,AA463,TRUE))","v":{"$error":"#DIV/0!"}},{"$error":"#DIV/0!"},null,null,null,{"$error":"#DIV/0!"}]
[null,null,null,null,null,null,null,0,null,null,null,0,0,0,{"$error":"#DIV/0!"},{"$error":"#DIV/0!"},{"$error":"#DIV/0!"},{"$error":"#DIV/0!"},{"$error":"#DIV/0!"},{"$error":"#DIV/0!"},{"$error":"#DIV/0!"},{"$f":"IF(A464=\"m\",VLOOKUP(P464,Berechnung_Male!$A$1:$D$42,AA464,TRUE),VLOOKUP(Eingabeblatt!P464,Berechnung_Female!$A$1:$D$42,AA464,TRUE))","v":{"$error":"#DIV/0!"}},{"$error":"#DIV/0!"},null,null,null,{"$error":"#DIV/0!"}]
[null,null,null,null,null,null,null,0,null,null,null,0,0,0,{"$error":"#DIV/0!"},{"$error":"#DIV/0!"},{"$error":"#DIV/0!"},{"$error":"#DIV/0!"},{"$error":"#DIV/0!"},{"$error":"#DIV/0!"},{"$error":"#DIV/0!"},{"$f":"IF(A465=\"m\",VLOOKUP(P465,Berechnung_Male!$A$1:$D$42,AA465,TRUE),VLOOKUP(Eingabeblatt!P465,Berechnung_Female!$A$1:$D$42,AA465,TRUE))","v":{"$error":"#DIV/0!"}},{"$error":"#DIV/0!"},null,null,null,{"$error":"#DIV/0!"}]
[null,null,null,null,null,null,null,0,null,null,null,0,0,0,{"$error":"#DIV/0!"},{"$error":"#DIV/0!"},{"$error":"#DIV/0!"},{"$error":"#DIV/0!"},{"$error":"#DIV/0!"},{"$error":"#DIV/0!"},{"$error":"#DIV/0!"},{"$f":"IF(A466=\"m\",VLOOKUP(P466,Berechnung_Male!$A$1:$D$42,AA466,TRUE),VLOOKUP(Eingabeblatt!P466,Berechnung_Female!$A$1:$D$42,AA466,TRUE))","v":{"$error":"#DIV/0!"}},{"$error":"#DIV/0!"},null,null,null,{"$error":"#DIV/0!"}]
[null,null,null,null,null,null,null,0,null,null,null,0,0,0,{"$error":"#DIV/0!"},{"$error":"#DIV/0!"},{"$error":"#DIV/0!"},{"$error":"#DIV/0!"},{"$error":"#DIV/0!"},{"$error":"#DIV/0!"},{"$error":"#DIV/0!"},{"$f":"IF(A467=\"m\",VLOOKUP(P467,Berechnung_Male!$A$1:$D$42,AA467,TRUE),VLOOKUP(Eingabeblatt!P467,Berechnung_Female!$A$1:$D$42,AA467,TRUE))","v":{"$error":"#DIV/0!"}},{"$error":"#DIV/0!"},null,null,null,{"$error":"#DIV/0!"}]
[null,null,null,null,null,null,null,0,null,null,null,0,0,0,{"$error":"#DIV/0!"},{"$error":"#DIV/0!"},{"$error":"#DIV/0!"},{"$error":"#DIV/0!"},{"$error":"#DIV/0!"},{"$error":"#DIV/0!"},{"$error":"#DIV/0!"},{"$f":"IF(A468=\"m\",VLOOKUP(P468,Berechnung_Male!$A$1:$D$42,AA468,TRUE),VLOOKUP(Eingabeblatt!P468,Berechnung_Female!$A$1:$D$42,AA468,TRUE))","v":{"$error":"#DIV/0!"}},{"$error":"#DIV/0!"},null,null,null,{"$error":"#DIV/0!"}]
[null,null,null,null,null,null,null,0,null,null,null,0,0,0,{"$error":"#DIV/0!"},{"$error":"#DIV/0!"},{"$error":"#DIV/0!"},{"$error":"#DIV/0!"},{"$error":"#DIV/0!"},{"$error":"#DIV/0!"},{"$error":"#DIV/0!"},{"$f":"IF(A469=\"m\",VLOOKUP(P469,Berechnung_Male!$A$1:$D$42,AA469,TRUE),VLOOKUP(Eingabeblatt!P469,Berechnung_Female!$A$1:$D$42,AA469,TRUE))","v":{"$error":"#DIV/0!"}},{"$error":"#DIV/0!"},null,null,null,{"$error":"#DIV/0!"}]
[null,null,null,null,null,null,null,0,null,null,null,0,0,0,{"$error":"#DIV/0!"},{"$error":"#DIV/0!"},{"$error":"#DIV/0!"},{"$error":"#DIV/0!"},{"$error":"#DIV/0!"},{"$error":"#DIV/0!"},{"$error":"#DIV/0!"},{"$f":"IF(A470=\"m\",VLOOKUP(P470,Berechnung_Male!$A$1:$D$42,AA470,TRUE),VLOOKUP(Eingabeblatt!P470,Berechnung_Female!$A$1:$D$42,AA470,TRUE))","v":{"$error":"#DIV/0!"}},{"$error":"#DIV/0!"},null,null,null,{"$error":"#DIV/0!"}]
[null,null,null,null,null,null,null,0,null,null,null,0,0,0,{"$error":"#DIV/0!"},{"$error":"#DIV/0!"},{"$error":"#DIV/0!"},{"$error":"#DIV/0!"},{"$error":"#DIV/0!"},{"$error":"#DIV/0!"},{"$error":"#DIV/0!"},{"$f":"IF(A471=\"m\",VLOOKUP(P471,Berechnung_Male!$A$1:$D$42,AA471,TRUE),VLOOKUP(Eingabeblatt!P471,Berechnung_Female!$A$1:$D$42,AA471,TRUE))","v":{"$error":"#DIV/0!"}},{"$error":"#DIV/0!"},null,null,null,{"$error":"#DIV/0!"}]
[null,null,null,null,null,null,null,0,null,null,null,0,0,0,{"$error":"#DIV/0!"},{"$error":"#DIV/0!"},{"$error":"#DIV/0!"},{"$error":"#DIV/0!"},{"$error":"#DIV/0!"},{"$error":"#DIV/0!"},{"$error":"#DIV/0!"},{"$f":"IF(A472=\"m\",VLOOKUP(P472,Berechnung_Male!$A$1:$D$42,AA472,TRUE),VLOOKUP(Eingabeblatt!P472,Berechnung_Female!$A$1:$D$42,AA472,TRUE))","v":{"$error":"#DIV/0!"}},{"$error":"#DIV/0!"},null,null,null,{"$error":"#DIV/0!"}]
[null,null,null,null,null,null,null,0,null,null,null,0,0,0,{"$error":"#DIV/0!"},{"$error":"#DIV/0!"},{"$error":"#DIV/0!"},{"$error":"#DIV/0!"},{"$error":"#DIV/0!"},{"$error":"#DIV/0!"},{"$error":"#DIV/0!"},{"$f":"IF(A473=\"m\",VLOOKUP(P473,Berechnung_Male!$A$1:$D$42,AA473,TRUE),VLOOKUP(Eingabeblatt!P473,Berechnung_Female!$A$1:$D$42,AA473,TRUE))","v":{"$error":"#DIV/0!"}},{"$error":"#DIV/0!"},null,null,null,{"$error":"#DIV/0!"}]
[null,null,null,null,null,null,null,0,null,null,null,0,0,0,{"$error":"#DIV/0!"},{"$error":"#DIV/0!"},{"$error":"#DIV/0!"},{"$error":"#DIV/0!"},{"$error":"#DIV/0!"},{"$error":"#DIV/0!"},{"$error":"#DIV/0!"},{"$f":"IF(A474=\"m\",VLOOKUP(P474,Berechnung_Male!$A$1:$D$42,AA474,TRUE),VLOOKUP(Eingabeblatt!P474,Berechnung_Female!$A$1:$D$42,AA474,TRUE))","v":{"$error":"#DIV/0!"}},{"$error":"#DIV/0!"},null,null,null,{"$error":"#DIV/0!"}]
[null,null,null,null,null,null,null,0,null,null,null,0,0,0,{"$error":"#DIV/0!"},{"$error":"#DIV/0!"},{"$error":"#DIV/0!"},{"$error":"#DIV/0!"},{"$error":"#DIV/0!"},{"$error":"#DIV/0!"},{"$error":"#DIV/0!"},{"$f":"IF(A475=\"m\",VLOOKUP(P475,Berechnung_Male!$A$1:$D$42,AA475,TRUE),VLOOKUP(Eingabeblatt!P475,Berechnung_Female!$A$1:$D$42,AA475,TRUE))","v":{"$error":"#DIV/0!"}},{"$error":"#DIV/0!"},null,null,null,{"$error":"#DIV/0!"}]
[null,null,null,null,null,null,null,0,null,null,null,0,0,0,{"$error":"#DIV/0!"},{"$error":"#DIV/0!"},{"$error":"#DIV/0!"},{"$error":"#DIV/0!"},{"$error":"#DIV/0!"},{"$error":"#DIV/0!"},{"$error":"#DIV/0!"},{"$f":"IF(A476=\"m\",VLOOKUP(P476,Berechnung_Male!$A$1:$D$42,AA476,TRUE),VLOOKUP(Eingabeblatt!P476,Berechnung_Female!$A$1:$D$42,AA476,TRUE))","v":{"$error":"#DIV/0!"}},{"$error":"#DIV/0!"},null,null,null,{"$error":"#DIV/0!"}]
[null,null,null,null,null,null,null,0,null,null,null,0,0,0,{"$error":"#DIV/0!"},{"$error":"#DIV/0!"},{"$error":"#DIV/0!"},{"$error":"#DIV/0!"},{"$error":"#DIV/0!"},{"$error":"#DIV/0!"},{"$error":"#DIV/0!"},{"$f":"IF(A477=\"m\",VLOOKUP(P477,Berechnung_Male!$A$1:$D$42,AA477,TRUE),VLOOKUP(Eingabeblatt!P477,Berechnung_Female!$A$1:$D$42,AA477,TRUE))","v":{"$error":"#DIV/0!"}},{"$error":"#DIV/0!"},null,null,null,{"$error":"#DIV/0!"}]
[null,null,null,null,null,null,null,0,null,null,null,0,0,0,{"$error":"#DIV/0!"},{"$error":"#DIV/0!"},{"$error":"#DIV/0!"},{"$error":"#DIV/0!"},{"$error":"#DIV/0!"},{"$error":"#DIV/0!"},{"$error":"#DIV/0!"},{"$f":"IF(A478=\"m\",VLOOKUP(P478,Berechnung_Male!$A$1:$D$42,AA478,TRUE),VLOOKUP(Eingabeblatt!P478,Berechnung_Female!$A$1:$D$42,AA478,TRUE))","v":{"$error":"#DIV/0!"}},{"$error":"#DIV/0!"},null,null,null,{"$error":"#DIV/0!"}]
[null,null,null,null,null,null,null,0,null,null,null,0,0,0,{"$error":"#DIV/0!"},{"$error":"#DIV/0!"},{"$error":"#DIV/0!"},{"$error":"#DIV/0!"},{"$error":"#DIV/0!"},{"$error":"#DIV/0!"},{"$error":"#DIV/0!"},{"$f":"IF(A479=\"m\",VLOOKUP(P479,Berechnung_Male!$A$1:$D$42,AA479,TRUE),VLOOKUP(Eingabeblatt!P479,Berechnung_Female!$A$1:$D$42,AA479,TRUE))","v":{"$error":"#DIV/0!"}},{"$error":"#DIV/0!"},null,null,null,{"$error":"#DIV/0!"}]
[null,null,null,null,null,null,null,0,null,null,null,0,0,0,{"$error":"#DIV/0!"},{"$error":"#DIV/0!"},{"$error":"#DIV/0!"},{"$error":"#DIV/0!"},{"$error":"#DIV/0!"},{"$error":"#DIV/0!"},{"$error":"#DIV/0!"},{"$f":"IF(A480=\"m\",VLOOKUP(P480,Berechnung_Male!$A$1:$D$42,AA480,TRUE),VLOOKUP(Eingabeblatt!P480,Berechnung_Female!$A$1:$D$42,AA480,TRUE))","v":{"$error":"#DIV/0!"}},{"$error":"#DIV/0!"},null,null,null,{"$error":"#DIV/0!"}]
[null,null,null,null,null,null,null,0,null,null,null,0,0,0,{"$error":"#DIV/0!"},{"$error":"#DIV/0!"},{"$error":"#DIV/0!"},{"$error":"#DIV/0!"},{"$error":"#DIV/0!"},{"$error":"#DIV/0!"},{"$error":"#DIV/0!"},{"$f":"IF(A481=\"m\",VLOOKUP(P481,Berechnung_Male!$A$1:$D$42,AA481,TRUE),VLOOKUP(Eingabeblatt!P481,Berechnung_Female!$A$1:$D$42,AA481,TRUE))","v":{"$error":"#DIV/0!"}},{"$error":"#DIV/0!"},null,null,null,{"$error":"#DIV/0!"}]
[null,null,null,null,null,null,null,0,null,null,null,0,0,0,{"$error":"#DIV/0!"},{"$error":"#DIV/0!"},{"$error":"#DIV/0!"},{"$error":"#DIV/0!"},{"$error":"#DIV/0!"},{"$error":"#DIV/0!"},{"$error":"#DIV/0!"},{"$f":"IF(A482=\"m\",VLOOKUP(P482,Berechnung_Male!$A$1:$D$42,AA482,TRUE),VLOOKUP(Eingabeblatt!P482,Berechnung_Female!$A$1:$D$42,AA482,TRUE))","v":{"$error":"#DIV/0!"}},{"$error":"#DIV/0!"},null,null,null,{"$error":"#DIV/0!"}]
[null,null,null,null,null,null,null,0,null,null,null,0,0,0,{"$error":"#DIV/0!"},{"$error":"#DIV/0!"},{"$error":"#DIV/0!"},{"$error":"#DIV/0!"},{"$error":"#DIV/0!"},{"$error":"#DIV/0!"},{"$error":"#DIV/0!"},{"$f":"IF(A483=\"m\",VLOOKUP(P483,Berechnung_Male!$A$1:$D$42,AA483,TRUE),VLOOKUP(Eingabeblatt!P483,Berechnung_Female!$A$1:$D$42,AA483,TRUE))","v":{"$error":"#DIV/0!"}},{"$error":"#DIV/0!"},null,null,null,{"$error":"#DIV/0!"}]
[null,null,null,null,null,null,null,0,null,null,null,0,0,0,{"$error":"#DIV/0!"},{"$error":"#DIV/0!"},{"$error":"#DIV/0!"},{"$error":"#DIV/0!"},{"$error":"#DIV/0!"},{"$error":"#DIV/0!"},{"$error":"#DIV/0!"},{"$f":"IF(A484=\"m\",VLOOKUP(P484,Berechnung_Male!$A$1:$D$42,AA484,TRUE),VLOOKUP(Eingabeblatt!P484,Berechnung_Female!$A$1:$D$42,AA484,TRUE))","v":{"$error":"#DIV/0!"}},{"$error":"#DIV/0!"},null,null,null,{"$error":"#DIV/0!"}]
[null,null,null,null,null,null,null,0,null,null,null,0,0,0,{"$error":"#DIV/0!"},{"$error":"#DIV/0!"},{"$error":"#DIV/0!"},{"$error":"#DIV/0!"},{"$error":"#DIV/0!"},{"$error":"#DIV/0!"},{"$error":"#DIV/0!"},{"$f":"IF(A485=\"m\",VLOOKUP(P485,Berechnung_Male!$A$1:$D$42,AA485,TRUE),VLOOKUP(Eingabeblatt!P485,Berechnung_Female!$A$1:$D$42,AA485,TRUE))","v":{"$error":"#DIV/0!"}},{"$error":"#DIV/0!"},null,null,null,{"$error":"#DIV/0!"}]
[null,null,null,null,null,null,null,0,null,null,null,0,0,0,{"$error":"#DIV/0!"},{"$error":"#DIV/0!"},{"$error":"#DIV/0!"},{"$error":"#DIV/0!"},{"$error":"#DIV/0!"},{"$error":"#DIV/0!"},{"$error":"#DIV/0!"},{"$f":"IF(A486=\"m\",VLOOKUP(P486,Berechnung_Male!$A$1:$D$42,AA486,TRUE),VLOOKUP(Eingabeblatt!P486,Berechnung_Female!$A$1:$D$42,AA486,TRUE))","v":{"$error":"#DIV/0!"}},{"$error":"#DIV/0!"},null,null,null,{"$error":"#DIV/0!"}]
[null,null,null,null,null,null,null,0,null,null,null,0,0,0,{"$error":"#DIV/0!"},{"$error":"#DIV/0!"},{"$error":"#DIV/0!"},{"$error":"#DIV/0!"},{"$error":"#DIV/0!"},{"$error":"#DIV/0!"},{"$error":"#DIV/0!"},{"$f":"IF(A487=\"m\",VLOOKUP(P487,Berechnung_Male!$A$1:$D$42,AA487,TRUE),VLOOKUP(Eingabeblatt!P487,Berechnung_Female!$A$1:$D$42,AA487,TRUE))","v":{"$error":"#DIV/0!"}},{"$error":"#DIV/0!"},null,null,null,{"$error":"#DIV/0!"}]
[null,null,null,null,null,null,null,0,null,null,null,0,0,0,{"$error":"#DIV/0!"},{"$error":"#DIV/0!"},{"$error":"#DIV/0!"},{"$error":"#DIV/0!"},{"$error":"#DIV/0!"},{"$error":"#DIV/0!"},{"$error":"#DIV/0!"},{"$f":"IF(A488=\"m\",VLOOKUP(P488,Berechnung_Male!$A$1:$D$42,AA488,TRUE),VLOOKUP(Eingabeblatt!P488,Berechnung_Female!$A$1:$D$42,AA488,TRUE))","v":{"$error":"#DIV/0!"}},{"$error":"#DIV/0!"},null,null,null,{"$error":"#DIV/0!"}]
[null,null,null,null,null,null,null,0,null,null,null,0,0,0,{"$error":"#DIV/0!"},{"$error":"#DIV/0!"},{"$error":"#DIV/0!"},{"$error":"#DIV/0!"},{"$error":"#DIV/0!"},{"$error":"#DIV/0!"},{"$error":"#DIV/0!"},{"$f":"IF(A489=\"m\",VLOOKUP(P489,Berechnung_Male!$A$1:$D$42,AA489,TRUE),VLOOKUP(Eingabeblatt!P489,Berechnung_Female!$A$1:$D$42,AA489,TRUE))","v":{"$error":"#DIV/0!"}},{"$error":"#DIV/0!"},null,null,null,{"$error":"#DIV/0!"}]
[null,null,null,null,null,null,null,0,null,null,null,0,0,0,{"$error":"#DIV/0!"},{"$error":"#DIV/0!"},{"$error":"#DIV/0!"},{"$error":"#DIV/0!"},{"$error":"#DIV/0!"},{"$error":"#DIV/0!"},{"$error":"#DIV/0!"},{"$f":"IF(A490=\"m\",VLOOKUP(P490,Berechnung_Male!$A$1:$D$42,AA490,TRUE),VLOOKUP(Eingabeblatt!P490,Berechnung_Female!$A$1:$D$42,AA490,TRUE))","v":{"$error":"#DIV/0!"}},{"$error":"#DIV/0!"},null,null,null,{"$error":"#DIV/0!"}]
[null,null,null,null,null,null,null,0,null,null,null,0,0,0,{"$error":"#DIV/0!"},{"$error":"#DIV/0!"},{"$error":"#DIV/0!"},{"$error":"#DIV/0!"},{"$error":"#DIV/0!"},{"$error":"#DIV/0!"},{"$error":"#DIV/0!"},{"$f":"IF(A491=\"m\",VLOOKUP(P491,Berechnung_Male!$A$1:$D$42,AA491,TRUE),VLOOKUP(Eingabeblatt!P491,Berechnung_Female!$A$1:$D$42,AA491,TRUE))","v":{"$error":"#DIV/0!"}},{"$error":"#DIV/0!"},null,null,null,{"$error":"#DIV/0!"}]
[null,null,null,null,null,null,null,0,null,null,null,0,0,0,{"$error":"#DIV/0!"},{"$error":"#DIV/0!"},{"$error":"#DIV/0!"},{"$error":"#DIV/0!"},{"$error":"#DIV/0!"},{"$error":"#DIV/0!"},{"$error":"#DIV/0!"},{"$f":"IF(A492=\"m\",VLOOKUP(P492,Berechnung_Male!$A$1:$D$42,AA492,TRUE),VLOOKUP(Eingabeblatt!P492,Berechnung_Female!$A$1:$D$42,AA492,TRUE))","v":{"$error":"#DIV/0!"}},{"$error":"#DIV/0!"},null,null,null,{"$error":"#DIV/0!"}]
[null,null,null,null,null,null,null,0,null,null,null,0,0,0,{"$error":"#DIV/0!"},{"$error":"#DIV/0!"},{"$error":"#DIV/0!"},{"$error":"#DIV/0!"},{"$error":"#DIV/0!"},{"$error":"#DIV/0!"},{"$error":"#DIV/0!"},{"$f":"IF(A493=\"m\",VLOOKUP(P493,Berechnung_Male!$A$1:$D$42,AA493,TRUE),VLOOKUP(Eingabeblatt!P493,Berechnung_Female!$A$1:$D$42,AA493,TRUE))","v":{"$error":"#DIV/0!"}},{"$error":"#DIV/0!"},null,null,null,{"$error":"#DIV/0!"}]
[null,null,null,null,null,null,null,0,null,null,null,0,0,0,{"$error":"#DIV/0!"},{"$error":"#DIV/0!"},{"$error":"#DIV/0!"},{"$error":"#DIV/0!"},{"$error":"#DIV/0!"},{"$error":"#DIV/0!"},{"$error":"#DIV/0!"},{"$f":"IF(A494=\"m\",VLOOKUP(P494,Berechnung_Male!$A$1:$D$42,AA494,TRUE),VLOOKUP(Eingabeblatt!P494,Berechnung_Female!$A$1:$D$42,AA494,TRUE))","v":{"$error":"#DIV/0!"}},{"$error":"#DIV/0!"},null,null,null,{"$error":"#DIV/0!"}]
[null,null,null,null,null,null,null,0,null,null,null,0,0,0,{"$error":"#DIV/0!"},{"$error":"#DIV/0!"},{"$error":"#DIV/0!"},{"$error":"#DIV/0!"},{"$error":"#DIV/0!"},{"$error":"#DIV/0!"},{"$error":"#DIV/0!"},{"$f":"IF(A495=\"m\",VLOOKUP(P495,Berechnung_Male!$A$1:$D$42,AA495,TRUE),VLOOKUP(Eingabeblatt!P495,Berechnung_Female!$A$1:$D$42,AA495,TRUE))","v":{"$error":"#DIV/0!"}},{"$error":"#DIV/0!"},null,null,null,{"$error":"#DIV/0!"}]
[null,null,null,null,null,null,null,0,null,null,null,0,0,0,{"$error":"#DIV/0!"},{"$error":"#DIV/0!"},{"$error":"#DIV/0!"},{"$error":"#DIV/0!"},{"$error":"#DIV/0!"},{"$error":"#DIV/0!"},{"$error":"#DIV/0!"},{"$f":"IF(A496=\"m\",VLOOKUP(P496,Berechnung_Male!$A$1:$D$42,AA496,TRUE),VLOOKUP(Eingabeblatt!P496,Berechnung_Female!$A$1:$D$42,AA496,TRUE))","v":{"$error":"#DIV/0!"}},{"$error":"#DIV/0!"},null,null,null,{"$error":"#DIV/0!"}]
[null,null,null,null,null,null,null,0,null,null,null,0,0,0,{"$error":"#DIV/0!"},{"$error":"#DIV/0!"},{"$error":"#DIV/0!"},{"$error":"#DIV/0!"},{"$error":"#DIV/0!"},{"$error":"#DIV/0!"},{"$error":"#DIV/0!"},{"$f":"IF(A497=\"m\",VLOOKUP(P497,Berechnung_Male!$A$1:$D$42,AA497,TRUE),VLOOKUP(Eingabeblatt!P497,Berechnung_Female!$A$1:$D$42,AA497,TRUE))","v":{"$error":"#DIV/0!"}},{"$error":"#DIV/0!"},null,null,null,{"$error":"#DIV/0!"}]
[null,null,null,null,null,null,null,0,null,null,null,0,0,0,{"$error":"#DIV/0!"},{"$error":"#DIV/0!"},{"$error":"#DIV/0!"},{"$error":"#DIV/0!"},{"$error":"#DIV/0!"},{"$error":"#DIV/0!"},{"$error":"#DIV/0!"},{"$f":"IF(A498=\"m\",VLOOKUP(P498,Berechnung_Male!$A$1:$D$42,AA498,TRUE),VLOOKUP(Eingabeblatt!P498,Berechnung_Female!$A$1:$D$42,AA498,TRUE))","v":{"$error":"#DIV/0!"}},{"$error":"#DIV/0!"},null,null,null,{"$error":"#DIV/0!"}]
[null,null,null,null,null,null,null,0,null,null,null,0,0,0,{"$error":"#DIV/0!"},{"$error":"#DIV/0!"},{"$error":"#DIV/0!"},{"$error":"#DIV/0!"},{"$error":"#DIV/0!"},{"$error":"#DIV/0!"},{"$error":"#DIV/0!"},{"$f":"IF(A499=\"m\",VLOOKUP(P499,Berechnung_Male!$A$1:$D$42,AA499,TRUE),VLOOKUP(Eingabeblatt!P499,Berechnung_Female!$A$1:$D$42,AA499,TRUE))","v":{"$error":"#DIV/0!"}},{"$error":"#DIV/0!"},null,null,null,{"$error":"#DIV/0!"}]
[null,null,null,null,null,null,null,0,null,null,null,0,0,0,{"$error":"#DIV/0!"},{"$error":"#DIV/0!"},{"$error":"#DIV/0!"},{"$error":"#DIV/0!"},{"$error":"#DIV/0!"},{"$error":"#DIV/0!"},{"$error":"#DIV/0!"},{"$f":"IF(A500=\"m\",VLOOKUP(P500,Berechnung_Male!$A$1:$D$42,AA500,TRUE),VLOOKUP(Eingabeblatt!P500,Berechnung_Female!$A$1:$D$42,AA500,TRUE))","v":{"$error":"#DIV/0!"}},{"$error":"#DIV/0!"},null,null,null,{"$error":"#DIV/0!"}]

{"sheet":"Ausgabeblatt","index":3,"n_rows":497,"n_cols":6,"rows_kept":497,"cut":false,"hidden":false,"merged":[]}
["Name\n\n\nNom","Vorname\n\n\nPrénom","Geburtsdatum\n\n\nDate de naissance","Messdatum\n\n\nDate de la mesure","Bio. Entwicklungsstand\nZahl (1-3)\n\nDéveloppement bio.\nCatégorie 1-3","Biologischer Entwicklungsstand\n\nEtat de développement biologique"]
[{"$f":"IF(Eingabeblatt!C5=\"\",\"\",Eingabeblatt!C5)","v":"rogez"},{"$f":"IF(Eingabeblatt!D5=\"\",\"\",Eingabeblatt!D5)","v":"Lucas"},{"$f":"IF(Eingabeblatt!E5=\"\",\"\",Eingabeblatt!E5)","v":"2002-07-15"},{"$f":"IF(Eingabeblatt!B5=\"\",\"\",Eingabeblatt!B5)","v":"2024-09-13"},{"$f":"Eingabeblatt!R5","v":3},{"$f":"Eingabeblatt!Q5","v":"Spät / Tardif"}]
[{"$f":"IF(Eingabeblatt!C6=\"\",\"\",Eingabeblatt!C6)","v":""},{"$f":"IF(Eingabeblatt!D6=\"\",\"\",Eingabeblatt!D6)","v":""},{"$f":"IF(Eingabeblatt!E6=\"\",\"\",Eingabeblatt!E6)","v":"2012-03-12"},{"$f":"IF(Eingabeblatt!B6=\"\",\"\",Eingabeblatt!B6)","v":"2024-09-13"},{"$f":"Eingabeblatt!R6","v":2},{"$f":"Eingabeblatt!Q6","v":"Durchschnittlich / Normal"}]
[{"$f":"IF(Eingabeblatt!C7=\"\",\"\",Eingabeblatt!C7)","v":""},{"$f":"IF(Eingabeblatt!D7=\"\",\"\",Eingabeblatt!D7)","v":""},{"$f":"IF(Eingabeblatt!E7=\"\",\"\",Eingabeblatt!E7)","v":"2014-03-15"},{"$f":"IF(Eingabeblatt!B7=\"\",\"\",Eingabeblatt!B7)","v":"2024-09-15"},{"$f":"Eingabeblatt!R7","v":2},{"$f":"Eingabeblatt!Q7","v":"Durchschnittlich / Normal"}]
[{"$f":"IF(Eingabeblatt!C8=\"\",\"\",Eingabeblatt!C8)","v":""},{"$f":"IF(Eingabeblatt!D8=\"\",\"\",Eingabeblatt!D8)","v":""},{"$f":"IF(Eingabeblatt!E8=\"\",\"\",Eingabeblatt!E8)","v":"2014-03-16"},{"$f":"IF(Eingabeblatt!B8=\"\",\"\",Eingabeblatt!B8)","v":"2024-09-16"},{"$f":"Eingabeblatt!R8","v":2},{"$f":"Eingabeblatt!Q8","v":"Durchschnittlich / Normal"}]
[{"$f":"IF(Eingabeblatt!C9=\"\",\"\",Eingabeblatt!C9)","v":""},{"$f":"IF(Eingabeblatt!D9=\"\",\"\",Eingabeblatt!D9)","v":""},{"$f":"IF(Eingabeblatt!E9=\"\",\"\",Eingabeblatt!E9)","v":""},{"$f":"IF(Eingabeblatt!B9=\"\",\"\",Eingabeblatt!B9)","v":""},{"$f":"Eingabeblatt!R9","v":{"$error":"#DIV/0!"}},{"$f":"Eingabeblatt!Q9","v":{"$error":"#DIV/0!"}}]
[{"$f":"IF(Eingabeblatt!C10=\"\",\"\",Eingabeblatt!C10)","v":""},{"$f":"IF(Eingabeblatt!D10=\"\",\"\",Eingabeblatt!D10)","v":""},{"$f":"IF(Eingabeblatt!E10=\"\",\"\",Eingabeblatt!E10)","v":""},{"$f":"IF(Eingabeblatt!B10=\"\",\"\",Eingabeblatt!B10)","v":""},{"$f":"Eingabeblatt!R10","v":{"$error":"#DIV/0!"}},{"$f":"Eingabeblatt!Q10","v":{"$error":"#DIV/0!"}}]
[{"$f":"IF(Eingabeblatt!C11=\"\",\"\",Eingabeblatt!C11)","v":""},{"$f":"IF(Eingabeblatt!D11=\"\",\"\",Eingabeblatt!D11)","v":""},{"$f":"IF(Eingabeblatt!E11=\"\",\"\",Eingabeblatt!E11)","v":""},{"$f":"IF(Eingabeblatt!B11=\"\",\"\",Eingabeblatt!B11)","v":""},{"$f":"Eingabeblatt!R11","v":{"$error":"#DIV/0!"}},{"$f":"Eingabeblatt!Q11","v":{"$error":"#DIV/0!"}}]
[{"$f":"IF(Eingabeblatt!C12=\"\",\"\",Eingabeblatt!C12)","v":""},{"$f":"IF(Eingabeblatt!D12=\"\",\"\",Eingabeblatt!D12)","v":""},{"$f":"IF(Eingabeblatt!E12=\"\",\"\",Eingabeblatt!E12)","v":""},{"$f":"IF(Eingabeblatt!B12=\"\",\"\",Eingabeblatt!B12)","v":""},{"$f":"Eingabeblatt!R12","v":{"$error":"#DIV/0!"}},{"$f":"Eingabeblatt!Q12","v":{"$error":"#DIV/0!"}}]
[{"$f":"IF(Eingabeblatt!C13=\"\",\"\",Eingabeblatt!C13)","v":""},{"$f":"IF(Eingabeblatt!D13=\"\",\"\",Eingabeblatt!D13)","v":""},{"$f":"IF(Eingabeblatt!E13=\"\",\"\",Eingabeblatt!E13)","v":""},{"$f":"IF(Eingabeblatt!B13=\"\",\"\",Eingabeblatt!B13)","v":""},{"$f":"Eingabeblatt!R13","v":{"$error":"#DIV/0!"}},{"$f":"Eingabeblatt!Q13","v":{"$error":"#DIV/0!"}}]
[{"$f":"IF(Eingabeblatt!C14=\"\",\"\",Eingabeblatt!C14)","v":""},{"$f":"IF(Eingabeblatt!D14=\"\",\"\",Eingabeblatt!D14)","v":""},{"$f":"IF(Eingabeblatt!E14=\"\",\"\",Eingabeblatt!E14)","v":""},{"$f":"IF(Eingabeblatt!B14=\"\",\"\",Eingabeblatt!B14)","v":""},{"$f":"Eingabeblatt!R14","v":{"$error":"#DIV/0!"}},{"$f":"Eingabeblatt!Q14","v":{"$error":"#DIV/0!"}}]
[{"$f":"IF(Eingabeblatt!C15=\"\",\"\",Eingabeblatt!C15)","v":""},{"$f":"IF(Eingabeblatt!D15=\"\",\"\",Eingabeblatt!D15)","v":""},{"$f":"IF(Eingabeblatt!E15=\"\",\"\",Eingabeblatt!E15)","v":""},{"$f":"IF(Eingabeblatt!B15=\"\",\"\",Eingabeblatt!B15)","v":""},{"$f":"Eingabeblatt!R15","v":{"$error":"#DIV/0!"}},{"$f":"Eingabeblatt!Q15","v":{"$error":"#DIV/0!"}}]
[{"$f":"IF(Eingabeblatt!C16=\"\",\"\",Eingabeblatt!C16)","v":""},{"$f":"IF(Eingabeblatt!D16=\"\",\"\",Eingabeblatt!D16)","v":""},{"$f":"IF(Eingabeblatt!E16=\"\",\"\",Eingabeblatt!E16)","v":""},{"$f":"IF(Eingabeblatt!B16=\"\",\"\",Eingabeblatt!B16)","v":""},{"$f":"Eingabeblatt!R16","v":{"$error":"#DIV/0!"}},{"$f":"Eingabeblatt!Q16","v":{"$error":"#DIV/0!"}}]
[{"$f":"IF(Eingabeblatt!C17=\"\",\"\",Eingabeblatt!C17)","v":""},{"$f":"IF(Eingabeblatt!D17=\"\",\"\",Eingabeblatt!D17)","v":""},{"$f":"IF(Eingabeblatt!E17=\"\",\"\",Eingabeblatt!E17)","v":""},{"$f":"IF(Eingabeblatt!B17=\"\",\"\",Eingabeblatt!B17)","v":""},{"$f":"Eingabeblatt!R17","v":{"$error":"#DIV/0!"}},{"$f":"Eingabeblatt!Q17","v":{"$error":"#DIV/0!"}}]
[{"$f":"IF(Eingabeblatt!C18=\"\",\"\",Eingabeblatt!C18)","v":""},{"$f":"IF(Eingabeblatt!D18=\"\",\"\",Eingabeblatt!D18)","v":""},{"$f":"IF(Eingabeblatt!E18=\"\",\"\",Eingabeblatt!E18)","v":""},{"$f":"IF(Eingabeblatt!B18=\"\",\"\",Eingabeblatt!B18)","v":""},{"$f":"Eingabeblatt!R18","v":{"$error":"#DIV/0!"}},{"$f":"Eingabeblatt!Q18","v":{"$error":"#DIV/0!"}}]
[{"$f":"IF(Eingabeblatt!C19=\"\",\"\",Eingabeblatt!C19)","v":""},{"$f":"IF(Eingabeblatt!D19=\"\",\"\",Eingabeblatt!D19)","v":""},{"$f":"IF(Eingabeblatt!E19=\"\",\"\",Eingabeblatt!E19)","v":""},{"$f":"IF(Eingabeblatt!B19=\"\",\"\",Eingabeblatt!B19)","v":""},{"$f":"Eingabeblatt!R19","v":{"$error":"#DIV/0!"}},{"$f":"Eingabeblatt!Q19","v":{"$error":"#DIV/0!"}}]
[{"$f":"IF(Eingabeblatt!C20=\"\",\"\",Eingabeblatt!C20)","v":""},{"$f":"IF(Eingabeblatt!D20=\"\",\"\",Eingabeblatt!D20)","v":""},{"$f":"IF(Eingabeblatt!E20=\"\",\"\",Eingabeblatt!E20)","v":""},{"$f":"IF(Eingabeblatt!B20=\"\",\"\",Eingabeblatt!B20)","v":""},{"$f":"Eingabeblatt!R20","v":{"$error":"#DIV/0!"}},{"$f":"Eingabeblatt!Q20","v":{"$error":"#DIV/0!"}}]
[{"$f":"IF(Eingabeblatt!C21=\"\",\"\",Eingabeblatt!C21)","v":""},{"$f":"IF(Eingabeblatt!D21=\"\",\"\",Eingabeblatt!D21)","v":""},{"$f":"IF(Eingabeblatt!E21=\"\",\"\",Eingabeblatt!E21)","v":""},{"$f":"IF(Eingabeblatt!B21=\"\",\"\",Eingabeblatt!B21)","v":""},{"$f":"Eingabeblatt!R21","v":{"$error":"#DIV/0!"}},{"$f":"Eingabeblatt!Q21","v":{"$error":"#DIV/0!"}}]
[{"$f":"IF(Eingabeblatt!C22=\"\",\"\",Eingabeblatt!C22)","v":""},{"$f":"IF(Eingabeblatt!D22=\"\",\"\",Eingabeblatt!D22)","v":""},{"$f":"IF(Eingabeblatt!E22=\"\",\"\",Eingabeblatt!E22)","v":""},{"$f":"IF(Eingabeblatt!B22=\"\",\"\",Eingabeblatt!B22)","v":""},{"$f":"Eingabeblatt!R22","v":{"$error":"#DIV/0!"}},{"$f":"Eingabeblatt!Q22","v":{"$error":"#DIV/0!"}}]
[{"$f":"IF(Eingabeblatt!C23=\"\",\"\",Eingabeblatt!C23)","v":""},{"$f":"IF(Eingabeblatt!D23=\"\",\"\",Eingabeblatt!D23)","v":""},{"$f":"IF(Eingabeblatt!E23=\"\",\"\",Eingabeblatt!E23)","v":""},{"$f":"IF(Eingabeblatt!B23=\"\",\"\",Eingabeblatt!B23)","v":""},{"$f":"Eingabeblatt!R23","v":{"$error":"#DIV/0!"}},{"$f":"Eingabeblatt!Q23","v":{"$error":"#DIV/0!"}}]
[{"$f":"IF(Eingabeblatt!C24=\"\",\"\",Eingabeblatt!C24)","v":""},{"$f":"IF(Eingabeblatt!D24=\"\",\"\",Eingabeblatt!D24)","v":""},{"$f":"IF(Eingabeblatt!E24=\"\",\"\",Eingabeblatt!E24)","v":""},{"$f":"IF(Eingabeblatt!B24=\"\",\"\",Eingabeblatt!B24)","v":""},{"$f":"Eingabeblatt!R24","v":{"$error":"#DIV/0!"}},{"$f":"Eingabeblatt!Q24","v":{"$error":"#DIV/0!"}}]
[{"$f":"IF(Eingabeblatt!C25=\"\",\"\",Eingabeblatt!C25)","v":""},{"$f":"IF(Eingabeblatt!D25=\"\",\"\",Eingabeblatt!D25)","v":""},{"$f":"IF(Eingabeblatt!E25=\"\",\"\",Eingabeblatt!E25)","v":""},{"$f":"IF(Eingabeblatt!B25=\"\",\"\",Eingabeblatt!B25)","v":""},{"$f":"Eingabeblatt!R25","v":{"$error":"#DIV/0!"}},{"$f":"Eingabeblatt!Q25","v":{"$error":"#DIV/0!"}}]
[{"$f":"IF(Eingabeblatt!C26=\"\",\"\",Eingabeblatt!C26)","v":""},{"$f":"IF(Eingabeblatt!D26=\"\",\"\",Eingabeblatt!D26)","v":""},{"$f":"IF(Eingabeblatt!E26=\"\",\"\",Eingabeblatt!E26)","v":""},{"$f":"IF(Eingabeblatt!B26=\"\",\"\",Eingabeblatt!B26)","v":""},{"$f":"Eingabeblatt!R26","v":{"$error":"#DIV/0!"}},{"$f":"Eingabeblatt!Q26","v":{"$error":"#DIV/0!"}}]
[{"$f":"IF(Eingabeblatt!C27=\"\",\"\",Eingabeblatt!C27)","v":""},{"$f":"IF(Eingabeblatt!D27=\"\",\"\",Eingabeblatt!D27)","v":""},{"$f":"IF(Eingabeblatt!E27=\"\",\"\",Eingabeblatt!E27)","v":""},{"$f":"IF(Eingabeblatt!B27=\"\",\"\",Eingabeblatt!B27)","v":""},{"$f":"Eingabeblatt!R27","v":{"$error":"#DIV/0!"}},{"$f":"Eingabeblatt!Q27","v":{"$error":"#DIV/0!"}}]
[{"$f":"IF(Eingabeblatt!C28=\"\",\"\",Eingabeblatt!C28)","v":""},{"$f":"IF(Eingabeblatt!D28=\"\",\"\",Eingabeblatt!D28)","v":""},{"$f":"IF(Eingabeblatt!E28=\"\",\"\",Eingabeblatt!E28)","v":""},{"$f":"IF(Eingabeblatt!B28=\"\",\"\",Eingabeblatt!B28)","v":""},{"$f":"Eingabeblatt!R28","v":{"$error":"#DIV/0!"}},{"$f":"Eingabeblatt!Q28","v":{"$error":"#DIV/0!"}}]
[{"$f":"IF(Eingabeblatt!C29=\"\",\"\",Eingabeblatt!C29)","v":""},{"$f":"IF(Eingabeblatt!D29=\"\",\"\",Eingabeblatt!D29)","v":""},{"$f":"IF(Eingabeblatt!E29=\"\",\"\",Eingabeblatt!E29)","v":""},{"$f":"IF(Eingabeblatt!B29=\"\",\"\",Eingabeblatt!B29)","v":""},{"$f":"Eingabeblatt!R29","v":{"$error":"#DIV/0!"}},{"$f":"Eingabeblatt!Q29","v":{"$error":"#DIV/0!"}}]
[{"$f":"IF(Eingabeblatt!C30=\"\",\"\",Eingabeblatt!C30)","v":""},{"$f":"IF(Eingabeblatt!D30=\"\",\"\",Eingabeblatt!D30)","v":""},{"$f":"IF(Eingabeblatt!E30=\"\",\"\",Eingabeblatt!E30)","v":""},{"$f":"IF(Eingabeblatt!B30=\"\",\"\",Eingabeblatt!B30)","v":""},{"$f":"Eingabeblatt!R30","v":{"$error":"#DIV/0!"}},{"$f":"Eingabeblatt!Q30","v":{"$error":"#DIV/0!"}}]
[{"$f":"IF(Eingabeblatt!C31=\"\",\"\",Eingabeblatt!C31)","v":""},{"$f":"IF(Eingabeblatt!D31=\"\",\"\",Eingabeblatt!D31)","v":""},{"$f":"IF(Eingabeblatt!E31=\"\",\"\",Eingabeblatt!E31)","v":""},{"$f":"IF(Eingabeblatt!B31=\"\",\"\",Eingabeblatt!B31)","v":""},{"$f":"Eingabeblatt!R31","v":{"$error":"#DIV/0!"}},{"$f":"Eingabeblatt!Q31","v":{"$error":"#DIV/0!"}}]
[{"$f":"IF(Eingabeblatt!C32=\"\",\"\",Eingabeblatt!C32)","v":""},{"$f":"IF(Eingabeblatt!D32=\"\",\"\",Eingabeblatt!D32)","v":""},{"$f":"IF(Eingabeblatt!E32=\"\",\"\",Eingabeblatt!E32)","v":""},{"$f":"IF(Eingabeblatt!B32=\"\",\"\",Eingabeblatt!B32)","v":""},{"$f":"Eingabeblatt!R32","v":{"$error":"#DIV/0!"}},{"$f":"Eingabeblatt!Q32","v":{"$error":"#DIV/0!"}}]
[{"$f":"IF(Eingabeblatt!C33=\"\",\"\",Eingabeblatt!C33)","v":""},{"$f":"IF(Eingabeblatt!D33=\"\",\"\",Eingabeblatt!D33)","v":""},{"$f":"IF(Eingabeblatt!E33=\"\",\"\",Eingabeblatt!E33)","v":""},{"$f":"IF(Eingabeblatt!B33=\"\",\"\",Eingabeblatt!B33)","v":""},{"$f":"Eingabeblatt!R33","v":{"$error":"#DIV/0!"}},{"$f":"Eingabeblatt!Q33","v":{"$error":"#DIV/0!"}}]
[{"$f":"IF(Eingabeblatt!C34=\"\",\"\",Eingabeblatt!C34)","v":""},{"$f":"IF(Eingabeblatt!D34=\"\",\"\",Eingabeblatt!D34)","v":""},{"$f":"IF(Eingabeblatt!E34=\"\",\"\",Eingabeblatt!E34)","v":""},{"$f":"IF(Eingabeblatt!B34=\"\",\"\",Eingabeblatt!B34)","v":""},{"$f":"Eingabeblatt!R34","v":{"$error":"#DIV/0!"}},{"$f":"Eingabeblatt!Q34","v":{"$error":"#DIV/0!"}}]
[{"$f":"IF(Eingabeblatt!C35=\"\",\"\",Eingabeblatt!C35)","v":""},{"$f":"IF(Eingabeblatt!D35=\"\",\"\",Eingabeblatt!D35)","v":""},{"$f":"IF(Eingabeblatt!E35=\"\",\"\",Eingabeblatt!E35)","v":""},{"$f":"IF(Eingabeblatt!B35=\"\",\"\",Eingabeblatt!B35)","v":""},{"$f":"Eingabeblatt!R35","v":{"$error":"#DIV/0!"}},{"$f":"Eingabeblatt!Q35","v":{"$error":"#DIV/0!"}}]
[{"$f":"IF(Eingabeblatt!C36=\"\",\"\",Eingabeblatt!C36)","v":""},{"$f":"IF(Eingabeblatt!D36=\"\",\"\",Eingabeblatt!D36)","v":""},{"$f":"IF(Eingabeblatt!E36=\"\",\"\",Eingabeblatt!E36)","v":""},{"$f":"IF(Eingabeblatt!B36=\"\",\"\",Eingabeblatt!B36)","v":""},{"$f":"Eingabeblatt!R36","v":{"$error":"#DIV/0!"}},{"$f":"Eingabeblatt!Q36","v":{"$error":"#DIV/0!"}}]
[{"$f":"IF(Eingabeblatt!C37=\"\",\"\",Eingabeblatt!C37)","v":""},{"$f":"IF(Eingabeblatt!D37=\"\",\"\",Eingabeblatt!D37)","v":""},{"$f":"IF(Eingabeblatt!E37=\"\",\"\",Eingabeblatt!E37)","v":""},{"$f":"IF(Eingabeblatt!B37=\"\",\"\",Eingabeblatt!B37)","v":""},{"$f":"Eingabeblatt!R37","v":{"$error":"#DIV/0!"}},{"$f":"Eingabeblatt!Q37","v":{"$error":"#DIV/0!"}}]
[{"$f":"IF(Eingabeblatt!C38=\"\",\"\",Eingabeblatt!C38)","v":""},{"$f":"IF(Eingabeblatt!D38=\"\",\"\",Eingabeblatt!D38)","v":""},{"$f":"IF(Eingabeblatt!E38=\"\",\"\",Eingabeblatt!E38)","v":""},{"$f":"IF(Eingabeblatt!B38=\"\",\"\",Eingabeblatt!B38)","v":""},{"$f":"Eingabeblatt!R38","v":{"$error":"#DIV/0!"}},{"$f":"Eingabeblatt!Q38","v":{"$error":"#DIV/0!"}}]
[{"$f":"IF(Eingabeblatt!C39=\"\",\"\",Eingabeblatt!C39)","v":""},{"$f":"IF(Eingabeblatt!D39=\"\",\"\",Eingabeblatt!D39)","v":""},{"$f":"IF(Eingabeblatt!E39=\"\",\"\",Eingabeblatt!E39)","v":""},{"$f":"IF(Eingabeblatt!B39=\"\",\"\",Eingabeblatt!B39)","v":""},{"$f":"Eingabeblatt!R39","v":{"$error":"#DIV/0!"}},{"$f":"Eingabeblatt!Q39","v":{"$error":"#DIV/0!"}}]
[{"$f":"IF(Eingabeblatt!C40=\"\",\"\",Eingabeblatt!C40)","v":""},{"$f":"IF(Eingabeblatt!D40=\"\",\"\",Eingabeblatt!D40)","v":""},{"$f":"IF(Eingabeblatt!E40=\"\",\"\",Eingabeblatt!E40)","v":""},{"$f":"IF(Eingabeblatt!B40=\"\",\"\",Eingabeblatt!B40)","v":""},{"$f":"Eingabeblatt!R40","v":{"$error":"#DIV/0!"}},{"$f":"Eingabeblatt!Q40","v":{"$error":"#DIV/0!"}}]
[{"$f":"IF(Eingabeblatt!C41=\"\",\"\",Eingabeblatt!C41)","v":""},{"$f":"IF(Eingabeblatt!D41=\"\",\"\",Eingabeblatt!D41)","v":""},{"$f":"IF(Eingabeblatt!E41=\"\",\"\",Eingabeblatt!E41)","v":""},{"$f":"IF(Eingabeblatt!B41=\"\",\"\",Eingabeblatt!B41)","v":""},{"$f":"Eingabeblatt!R41","v":{"$error":"#DIV/0!"}},{"$f":"Eingabeblatt!Q41","v":{"$error":"#DIV/0!"}}]
[{"$f":"IF(Eingabeblatt!C42=\"\",\"\",Eingabeblatt!C42)","v":""},{"$f":"IF(Eingabeblatt!D42=\"\",\"\",Eingabeblatt!D42)","v":""},{"$f":"IF(Eingabeblatt!E42=\"\",\"\",Eingabeblatt!E42)","v":""},{"$f":"IF(Eingabeblatt!B42=\"\",\"\",Eingabeblatt!B42)","v":""},{"$f":"Eingabeblatt!R42","v":{"$error":"#DIV/0!"}},{"$f":"Eingabeblatt!Q42","v":{"$error":"#DIV/0!"}}]
[{"$f":"IF(Eingabeblatt!C43=\"\",\"\",Eingabeblatt!C43)","v":""},{"$f":"IF(Eingabeblatt!D43=\"\",\"\",Eingabeblatt!D43)","v":""},{"$f":"IF(Eingabeblatt!E43=\"\",\"\",Eingabeblatt!E43)","v":""},{"$f":"IF(Eingabeblatt!B43=\"\",\"\",Eingabeblatt!B43)","v":""},{"$f":"Eingabeblatt!R43","v":{"$error":"#DIV/0!"}},{"$f":"Eingabeblatt!Q43","v":{"$error":"#DIV/0!"}}]
[{"$f":"IF(Eingabeblatt!C44=\"\",\"\",Eingabeblatt!C44)","v":""},{"$f":"IF(Eingabeblatt!D44=\"\",\"\",Eingabeblatt!D44)","v":""},{"$f":"IF(Eingabeblatt!E44=\"\",\"\",Eingabeblatt!E44)","v":""},{"$f":"IF(Eingabeblatt!B44=\"\",\"\",Eingabeblatt!B44)","v":""},{"$f":"Eingabeblatt!R44","v":{"$error":"#DIV/0!"}},{"$f":"Eingabeblatt!Q44","v":{"$error":"#DIV/0!"}}]
[{"$f":"IF(Eingabeblatt!C45=\"\",\"\",Eingabeblatt!C45)","v":""},{"$f":"IF(Eingabeblatt!D45=\"\",\"\",Eingabeblatt!D45)","v":""},{"$f":"IF(Eingabeblatt!E45=\"\",\"\",Eingabeblatt!E45)","v":""},{"$f":"IF(Eingabeblatt!B45=\"\",\"\",Eingabeblatt!B45)","v":""},{"$f":"Eingabeblatt!R45","v":{"$error":"#DIV/0!"}},{"$f":"Eingabeblatt!Q45","v":{"$error":"#DIV/0!"}}]
[{"$f":"IF(Eingabeblatt!C46=\"\",\"\",Eingabeblatt!C46)","v":""},{"$f":"IF(Eingabeblatt!D46=\"\",\"\",Eingabeblatt!D46)","v":""},{"$f":"IF(Eingabeblatt!E46=\"\",\"\",Eingabeblatt!E46)","v":""},{"$f":"IF(Eingabeblatt!B46=\"\",\"\",Eingabeblatt!B46)","v":""},{"$f":"Eingabeblatt!R46","v":{"$error":"#DIV/0!"}},{"$f":"Eingabeblatt!Q46","v":{"$error":"#DIV/0!"}}]
[{"$f":"IF(Eingabeblatt!C47=\"\",\"\",Eingabeblatt!C47)","v":""},{"$f":"IF(Eingabeblatt!D47=\"\",\"\",Eingabeblatt!D47)","v":""},{"$f":"IF(Eingabeblatt!E47=\"\",\"\",Eingabeblatt!E47)","v":""},{"$f":"IF(Eingabeblatt!B47=\"\",\"\",Eingabeblatt!B47)","v":""},{"$f":"Eingabeblatt!R47","v":{"$error":"#DIV/0!"}},{"$f":"Eingabeblatt!Q47","v":{"$error":"#DIV/0!"}}]
[{"$f":"IF(Eingabeblatt!C48=\"\",\"\",Eingabeblatt!C48)","v":""},{"$f":"IF(Eingabeblatt!D48=\"\",\"\",Eingabeblatt!D48)","v":""},{"$f":"IF(Eingabeblatt!E48=\"\",\"\",Eingabeblatt!E48)","v":""},{"$f":"IF(Eingabeblatt!B48=\"\",\"\",Eingabeblatt!B48)","v":""},{"$f":"Eingabeblatt!R48","v":{"$error":"#DIV/0!"}},{"$f":"Eingabeblatt!Q48","v":{"$error":"#DIV/0!"}}]
[{"$f":"IF(Eingabeblatt!C49=\"\",\"\",Eingabeblatt!C49)","v":""},{"$f":"IF(Eingabeblatt!D49=\"\",\"\",Eingabeblatt!D49)","v":""},{"$f":"IF(Eingabeblatt!E49=\"\",\"\",Eingabeblatt!E49)","v":""},{"$f":"IF(Eingabeblatt!B49=\"\",\"\",Eingabeblatt!B49)","v":""},{"$f":"Eingabeblatt!R49","v":{"$error":"#DIV/0!"}},{"$f":"Eingabeblatt!Q49","v":{"$error":"#DIV/0!"}}]
[{"$f":"IF(Eingabeblatt!C50=\"\",\"\",Eingabeblatt!C50)","v":""},{"$f":"IF(Eingabeblatt!D50=\"\",\"\",Eingabeblatt!D50)","v":""},{"$f":"IF(Eingabeblatt!E50=\"\",\"\",Eingabeblatt!E50)","v":""},{"$f":"IF(Eingabeblatt!B50=\"\",\"\",Eingabeblatt!B50)","v":""},{"$f":"Eingabeblatt!R50","v":{"$error":"#DIV/0!"}},{"$f":"Eingabeblatt!Q50","v":{"$error":"#DIV/0!"}}]
[{"$f":"IF(Eingabeblatt!C51=\"\",\"\",Eingabeblatt!C51)","v":""},{"$f":"IF(Eingabeblatt!D51=\"\",\"\",Eingabeblatt!D51)","v":""},{"$f":"IF(Eingabeblatt!E51=\"\",\"\",Eingabeblatt!E51)","v":""},{"$f":"IF(Eingabeblatt!B51=\"\",\"\",Eingabeblatt!B51)","v":""},{"$f":"Eingabeblatt!R51","v":{"$error":"#DIV/0!"}},{"$f":"Eingabeblatt!Q51","v":{"$error":"#DIV/0!"}}]
[{"$f":"IF(Eingabeblatt!C52=\"\",\"\",Eingabeblatt!C52)","v":""},{"$f":"IF(Eingabeblatt!D52=\"\",\"\",Eingabeblatt!D52)","v":""},{"$f":"IF(Eingabeblatt!E52=\"\",\"\",Eingabeblatt!E52)","v":""},{"$f":"IF(Eingabeblatt!B52=\"\",\"\",Eingabeblatt!B52)","v":""},{"$f":"Eingabeblatt!R52","v":{"$error":"#DIV/0!"}},{"$f":"Eingabeblatt!Q52","v":{"$error":"#DIV/0!"}}]
[{"$f":"IF(Eingabeblatt!C53=\"\",\"\",Eingabeblatt!C53)","v":""},{"$f":"IF(Eingabeblatt!D53=\"\",\"\",Eingabeblatt!D53)","v":""},{"$f":"IF(Eingabeblatt!E53=\"\",\"\",Eingabeblatt!E53)","v":""},{"$f":"IF(Eingabeblatt!B53=\"\",\"\",Eingabeblatt!B53)","v":""},{"$f":"Eingabeblatt!R53","v":{"$error":"#DIV/0!"}},{"$f":"Eingabeblatt!Q53","v":{"$error":"#DIV/0!"}}]
[{"$f":"IF(Eingabeblatt!C54=\"\",\"\",Eingabeblatt!C54)","v":""},{"$f":"IF(Eingabeblatt!D54=\"\",\"\",Eingabeblatt!D54)","v":""},{"$f":"IF(Eingabeblatt!E54=\"\",\"\",Eingabeblatt!E54)","v":""},{"$f":"IF(Eingabeblatt!B54=\"\",\"\",Eingabeblatt!B54)","v":""},{"$f":"Eingabeblatt!R54","v":{"$error":"#DIV/0!"}},{"$f":"Eingabeblatt!Q54","v":{"$error":"#DIV/0!"}}]
[{"$f":"IF(Eingabeblatt!C55=\"\",\"\",Eingabeblatt!C55)","v":""},{"$f":"IF(Eingabeblatt!D55=\"\",\"\",Eingabeblatt!D55)","v":""},{"$f":"IF(Eingabeblatt!E55=\"\",\"\",Eingabeblatt!E55)","v":""},{"$f":"IF(Eingabeblatt!B55=\"\",\"\",Eingabeblatt!B55)","v":""},{"$f":"Eingabeblatt!R55","v":{"$error":"#DIV/0!"}},{"$f":"Eingabeblatt!Q55","v":{"$error":"#DIV/0!"}}]
[{"$f":"IF(Eingabeblatt!C56=\"\",\"\",Eingabeblatt!C56)","v":""},{"$f":"IF(Eingabeblatt!D56=\"\",\"\",Eingabeblatt!D56)","v":""},{"$f":"IF(Eingabeblatt!E56=\"\",\"\",Eingabeblatt!E56)","v":""},{"$f":"IF(Eingabeblatt!B56=\"\",\"\",Eingabeblatt!B56)","v":""},{"$f":"Eingabeblatt!R56","v":{"$error":"#DIV/0!"}},{"$f":"Eingabeblatt!Q56","v":{"$error":"#DIV/0!"}}]
[{"$f":"IF(Eingabeblatt!C57=\"\",\"\",Eingabeblatt!C57)","v":""},{"$f":"IF(Eingabeblatt!D57=\"\",\"\",Eingabeblatt!D57)","v":""},{"$f":"IF(Eingabeblatt!E57=\"\",\"\",Eingabeblatt!E57)","v":""},{"$f":"IF(Eingabeblatt!B57=\"\",\"\",Eingabeblatt!B57)","v":""},{"$f":"Eingabeblatt!R57","v":{"$error":"#DIV/0!"}},{"$f":"Eingabeblatt!Q57","v":{"$error":"#DIV/0!"}}]
[{"$f":"IF(Eingabeblatt!C58=\"\",\"\",Eingabeblatt!C58)","v":""},{"$f":"IF(Eingabeblatt!D58=\"\",\"\",Eingabeblatt!D58)","v":""},{"$f":"IF(Eingabeblatt!E58=\"\",\"\",Eingabeblatt!E58)","v":""},{"$f":"IF(Eingabeblatt!B58=\"\",\"\",Eingabeblatt!B58)","v":""},{"$f":"Eingabeblatt!R58","v":{"$error":"#DIV/0!"}},{"$f":"Eingabeblatt!Q58","v":{"$error":"#DIV/0!"}}]
[{"$f":"IF(Eingabeblatt!C59=\"\",\"\",Eingabeblatt!C59)","v":""},{"$f":"IF(Eingabeblatt!D59=\"\",\"\",Eingabeblatt!D59)","v":""},{"$f":"IF(Eingabeblatt!E59=\"\",\"\",Eingabeblatt!E59)","v":""},{"$f":"IF(Eingabeblatt!B59=\"\",\"\",Eingabeblatt!B59)","v":""},{"$f":"Eingabeblatt!R59","v":{"$error":"#DIV/0!"}},{"$f":"Eingabeblatt!Q59","v":{"$error":"#DIV/0!"}}]
[{"$f":"IF(Eingabeblatt!C60=\"\",\"\",Eingabeblatt!C60)","v":""},{"$f":"IF(Eingabeblatt!D60=\"\",\"\",Eingabeblatt!D60)","v":""},{"$f":"IF(Eingabeblatt!E60=\"\",\"\",Eingabeblatt!E60)","v":""},{"$f":"IF(Eingabeblatt!B60=\"\",\"\",Eingabeblatt!B60)","v":""},{"$f":"Eingabeblatt!R60","v":{"$error":"#DIV/0!"}},{"$f":"Eingabeblatt!Q60","v":{"$error":"#DIV/0!"}}]
[{"$f":"IF(Eingabeblatt!C61=\"\",\"\",Eingabeblatt!C61)","v":""},{"$f":"IF(Eingabeblatt!D61=\"\",\"\",Eingabeblatt!D61)","v":""},{"$f":"IF(Eingabeblatt!E61=\"\",\"\",Eingabeblatt!E61)","v":""},{"$f":"IF(Eingabeblatt!B61=\"\",\"\",Eingabeblatt!B61)","v":""},{"$f":"Eingabeblatt!R61","v":{"$error":"#DIV/0!"}},{"$f":"Eingabeblatt!Q61","v":{"$error":"#DIV/0!"}}]
[{"$f":"IF(Eingabeblatt!C62=\"\",\"\",Eingabeblatt!C62)","v":""},{"$f":"IF(Eingabeblatt!D62=\"\",\"\",Eingabeblatt!D62)","v":""},{"$f":"IF(Eingabeblatt!E62=\"\",\"\",Eingabeblatt!E62)","v":""},{"$f":"IF(Eingabeblatt!B62=\"\",\"\",Eingabeblatt!B62)","v":""},{"$f":"Eingabeblatt!R62","v":{"$error":"#DIV/0!"}},{"$f":"Eingabeblatt!Q62","v":{"$error":"#DIV/0!"}}]
[{"$f":"IF(Eingabeblatt!C63=\"\",\"\",Eingabeblatt!C63)","v":""},{"$f":"IF(Eingabeblatt!D63=\"\",\"\",Eingabeblatt!D63)","v":""},{"$f":"IF(Eingabeblatt!E63=\"\",\"\",Eingabeblatt!E63)","v":""},{"$f":"IF(Eingabeblatt!B63=\"\",\"\",Eingabeblatt!B63)","v":""},{"$f":"Eingabeblatt!R63","v":{"$error":"#DIV/0!"}},{"$f":"Eingabeblatt!Q63","v":{"$error":"#DIV/0!"}}]
[{"$f":"IF(Eingabeblatt!C64=\"\",\"\",Eingabeblatt!C64)","v":""},{"$f":"IF(Eingabeblatt!D64=\"\",\"\",Eingabeblatt!D64)","v":""},{"$f":"IF(Eingabeblatt!E64=\"\",\"\",Eingabeblatt!E64)","v":""},{"$f":"IF(Eingabeblatt!B64=\"\",\"\",Eingabeblatt!B64)","v":""},{"$f":"Eingabeblatt!R64","v":{"$error":"#DIV/0!"}},{"$f":"Eingabeblatt!Q64","v":{"$error":"#DIV/0!"}}]
[{"$f":"IF(Eingabeblatt!C65=\"\",\"\",Eingabeblatt!C65)","v":""},{"$f":"IF(Eingabeblatt!D65=\"\",\"\",Eingabeblatt!D65)","v":""},{"$f":"IF(Eingabeblatt!E65=\"\",\"\",Eingabeblatt!E65)","v":""},{"$f":"IF(Eingabeblatt!B65=\"\",\"\",Eingabeblatt!B65)","v":""},{"$f":"Eingabeblatt!R65","v":{"$error":"#DIV/0!"}},{"$f":"Eingabeblatt!Q65","v":{"$error":"#DIV/0!"}}]
[{"$f":"IF(Eingabeblatt!C66=\"\",\"\",Eingabeblatt!C66)","v":""},{"$f":"IF(Eingabeblatt!D66=\"\",\"\",Eingabeblatt!D66)","v":""},{"$f":"IF(Eingabeblatt!E66=\"\",\"\",Eingabeblatt!E66)","v":""},{"$f":"IF(Eingabeblatt!B66=\"\",\"\",Eingabeblatt!B66)","v":""},{"$f":"Eingabeblatt!R66","v":{"$error":"#DIV/0!"}},{"$f":"Eingabeblatt!Q66","v":{"$error":"#DIV/0!"}}]
[{"$f":"IF(Eingabeblatt!C67=\"\",\"\",Eingabeblatt!C67)","v":""},{"$f":"IF(Eingabeblatt!D67=\"\",\"\",Eingabeblatt!D67)","v":""},{"$f":"IF(Eingabeblatt!E67=\"\",\"\",Eingabeblatt!E67)","v":""},{"$f":"IF(Eingabeblatt!B67=\"\",\"\",Eingabeblatt!B67)","v":""},{"$f":"Eingabeblatt!R67","v":{"$error":"#DIV/0!"}},{"$f":"Eingabeblatt!Q67","v":{"$error":"#DIV/0!"}}]
[{"$f":"IF(Eingabeblatt!C68=\"\",\"\",Eingabeblatt!C68)","v":""},{"$f":"IF(Eingabeblatt!D68=\"\",\"\",Eingabeblatt!D68)","v":""},{"$f":"IF(Eingabeblatt!E68=\"\",\"\",Eingabeblatt!E68)","v":""},{"$f":"IF(Eingabeblatt!B68=\"\",\"\",Eingabeblatt!B68)","v":""},{"$f":"Eingabeblatt!R68","v":{"$error":"#DIV/0!"}},{"$f":"Eingabeblatt!Q68","v":{"$error":"#DIV/0!"}}]
[{"$f":"IF(Eingabeblatt!C69=\"\",\"\",Eingabeblatt!C69)","v":""},{"$f":"IF(Eingabeblatt!D69=\"\",\"\",Eingabeblatt!D69)","v":""},{"$f":"IF(Eingabeblatt!E69=\"\",\"\",Eingabeblatt!E69)","v":""},{"$f":"IF(Eingabeblatt!B69=\"\",\"\",Eingabeblatt!B69)","v":""},{"$f":"Eingabeblatt!R69","v":{"$error":"#DIV/0!"}},{"$f":"Eingabeblatt!Q69","v":{"$error":"#DIV/0!"}}]
[{"$f":"IF(Eingabeblatt!C70=\"\",\"\",Eingabeblatt!C70)","v":""},{"$f":"IF(Eingabeblatt!D70=\"\",\"\",Eingabeblatt!D70)","v":""},{"$f":"IF(Eingabeblatt!E70=\"\",\"\",Eingabeblatt!E70)","v":""},{"$f":"IF(Eingabeblatt!B70=\"\",\"\",Eingabeblatt!B70)","v":""},{"$f":"Eingabeblatt!R70","v":{"$error":"#DIV/0!"}},{"$f":"Eingabeblatt!Q70","v":{"$error":"#DIV/0!"}}]
[{"$f":"IF(Eingabeblatt!C71=\"\",\"\",Eingabeblatt!C71)","v":""},{"$f":"IF(Eingabeblatt!D71=\"\",\"\",Eingabeblatt!D71)","v":""},{"$f":"IF(Eingabeblatt!E71=\"\",\"\",Eingabeblatt!E71)","v":""},{"$f":"IF(Eingabeblatt!B71=\"\",\"\",Eingabeblatt!B71)","v":""},{"$f":"Eingabeblatt!R71","v":{"$error":"#DIV/0!"}},{"$f":"Eingabeblatt!Q71","v":{"$error":"#DIV/0!"}}]
[{"$f":"IF(Eingabeblatt!C72=\"\",\"\",Eingabeblatt!C72)","v":""},{"$f":"IF(Eingabeblatt!D72=\"\",\"\",Eingabeblatt!D72)","v":""},{"$f":"IF(Eingabeblatt!E72=\"\",\"\",Eingabeblatt!E72)","v":""},{"$f":"IF(Eingabeblatt!B72=\"\",\"\",Eingabeblatt!B72)","v":""},{"$f":"Eingabeblatt!R72","v":{"$error":"#DIV/0!"}},{"$f":"Eingabeblatt!Q72","v":{"$error":"#DIV/0!"}}]
[{"$f":"IF(Eingabeblatt!C73=\"\",\"\",Eingabeblatt!C73)","v":""},{"$f":"IF(Eingabeblatt!D73=\"\",\"\",Eingabeblatt!D73)","v":""},{"$f":"IF(Eingabeblatt!E73=\"\",\"\",Eingabeblatt!E73)","v":""},{"$f":"IF(Eingabeblatt!B73=\"\",\"\",Eingabeblatt!B73)","v":""},{"$f":"Eingabeblatt!R73","v":{"$error":"#DIV/0!"}},{"$f":"Eingabeblatt!Q73","v":{"$error":"#DIV/0!"}}]
[{"$f":"IF(Eingabeblatt!C74=\"\",\"\",Eingabeblatt!C74)","v":""},{"$f":"IF(Eingabeblatt!D74=\"\",\"\",Eingabeblatt!D74)","v":""},{"$f":"IF(Eingabeblatt!E74=\"\",\"\",Eingabeblatt!E74)","v":""},{"$f":"IF(Eingabeblatt!B74=\"\",\"\",Eingabeblatt!B74)","v":""},{"$f":"Eingabeblatt!R74","v":{"$error":"#DIV/0!"}},{"$f":"Eingabeblatt!Q74","v":{"$error":"#DIV/0!"}}]
[{"$f":"IF(Eingabeblatt!C75=\"\",\"\",Eingabeblatt!C75)","v":""},{"$f":"IF(Eingabeblatt!D75=\"\",\"\",Eingabeblatt!D75)","v":""},{"$f":"IF(Eingabeblatt!E75=\"\",\"\",Eingabeblatt!E75)","v":""},{"$f":"IF(Eingabeblatt!B75=\"\",\"\",Eingabeblatt!B75)","v":""},{"$f":"Eingabeblatt!R75","v":{"$error":"#DIV/0!"}},{"$f":"Eingabeblatt!Q75","v":{"$error":"#DIV/0!"}}]
[{"$f":"IF(Eingabeblatt!C76=\"\",\"\",Eingabeblatt!C76)","v":""},{"$f":"IF(Eingabeblatt!D76=\"\",\"\",Eingabeblatt!D76)","v":""},{"$f":"IF(Eingabeblatt!E76=\"\",\"\",Eingabeblatt!E76)","v":""},{"$f":"IF(Eingabeblatt!B76=\"\",\"\",Eingabeblatt!B76)","v":""},{"$f":"Eingabeblatt!R76","v":{"$error":"#DIV/0!"}},{"$f":"Eingabeblatt!Q76","v":{"$error":"#DIV/0!"}}]
[{"$f":"IF(Eingabeblatt!C77=\"\",\"\",Eingabeblatt!C77)","v":""},{"$f":"IF(Eingabeblatt!D77=\"\",\"\",Eingabeblatt!D77)","v":""},{"$f":"IF(Eingabeblatt!E77=\"\",\"\",Eingabeblatt!E77)","v":""},{"$f":"IF(Eingabeblatt!B77=\"\",\"\",Eingabeblatt!B77)","v":""},{"$f":"Eingabeblatt!R77","v":{"$error":"#DIV/0!"}},{"$f":"Eingabeblatt!Q77","v":{"$error":"#DIV/0!"}}]
[{"$f":"IF(Eingabeblatt!C78=\"\",\"\",Eingabeblatt!C78)","v":""},{"$f":"IF(Eingabeblatt!D78=\"\",\"\",Eingabeblatt!D78)","v":""},{"$f":"IF(Eingabeblatt!E78=\"\",\"\",Eingabeblatt!E78)","v":""},{"$f":"IF(Eingabeblatt!B78=\"\",\"\",Eingabeblatt!B78)","v":""},{"$f":"Eingabeblatt!R78","v":{"$error":"#DIV/0!"}},{"$f":"Eingabeblatt!Q78","v":{"$error":"#DIV/0!"}}]
[{"$f":"IF(Eingabeblatt!C79=\"\",\"\",Eingabeblatt!C79)","v":""},{"$f":"IF(Eingabeblatt!D79=\"\",\"\",Eingabeblatt!D79)","v":""},{"$f":"IF(Eingabeblatt!E79=\"\",\"\",Eingabeblatt!E79)","v":""},{"$f":"IF(Eingabeblatt!B79=\"\",\"\",Eingabeblatt!B79)","v":""},{"$f":"Eingabeblatt!R79","v":{"$error":"#DIV/0!"}},{"$f":"Eingabeblatt!Q79","v":{"$error":"#DIV/0!"}}]
[{"$f":"IF(Eingabeblatt!C80=\"\",\"\",Eingabeblatt!C80)","v":""},{"$f":"IF(Eingabeblatt!D80=\"\",\"\",Eingabeblatt!D80)","v":""},{"$f":"IF(Eingabeblatt!E80=\"\",\"\",Eingabeblatt!E80)","v":""},{"$f":"IF(Eingabeblatt!B80=\"\",\"\",Eingabeblatt!B80)","v":""},{"$f":"Eingabeblatt!R80","v":{"$error":"#DIV/0!"}},{"$f":"Eingabeblatt!Q80","v":{"$error":"#DIV/0!"}}]
[{"$f":"IF(Eingabeblatt!C81=\"\",\"\",Eingabeblatt!C81)","v":""},{"$f":"IF(Eingabeblatt!D81=\"\",\"\",Eingabeblatt!D81)","v":""},{"$f":"IF(Eingabeblatt!E81=\"\",\"\",Eingabeblatt!E81)","v":""},{"$f":"IF(Eingabeblatt!B81=\"\",\"\",Eingabeblatt!B81)","v":""},{"$f":"Eingabeblatt!R81","v":{"$error":"#DIV/0!"}},{"$f":"Eingabeblatt!Q81","v":{"$error":"#DIV/0!"}}]
[{"$f":"IF(Eingabeblatt!C82=\"\",\"\",Eingabeblatt!C82)","v":""},{"$f":"IF(Eingabeblatt!D82=\"\",\"\",Eingabeblatt!D82)","v":""},{"$f":"IF(Eingabeblatt!E82=\"\",\"\",Eingabeblatt!E82)","v":""},{"$f":"IF(Eingabeblatt!B82=\"\",\"\",Eingabeblatt!B82)","v":""},{"$f":"Eingabeblatt!R82","v":{"$error":"#DIV/0!"}},{"$f":"Eingabeblatt!Q82","v":{"$error":"#DIV/0!"}}]
[{"$f":"IF(Eingabeblatt!C83=\"\",\"\",Eingabeblatt!C83)","v":""},{"$f":"IF(Eingabeblatt!D83=\"\",\"\",Eingabeblatt!D83)","v":""},{"$f":"IF(Eingabeblatt!E83=\"\",\"\",Eingabeblatt!E83)","v":""},{"$f":"IF(Eingabeblatt!B83=\"\",\"\",Eingabeblatt!B83)","v":""},{"$f":"Eingabeblatt!R83","v":{"$error":"#DIV/0!"}},{"$f":"Eingabeblatt!Q83","v":{"$error":"#DIV/0!"}}]
[{"$f":"IF(Eingabeblatt!C84=\"\",\"\",Eingabeblatt!C84)","v":""},{"$f":"IF(Eingabeblatt!D84=\"\",\"\",Eingabeblatt!D84)","v":""},{"$f":"IF(Eingabeblatt!E84=\"\",\"\",Eingabeblatt!E84)","v":""},{"$f":"IF(Eingabeblatt!B84=\"\",\"\",Eingabeblatt!B84)","v":""},{"$f":"Eingabeblatt!R84","v":{"$error":"#DIV/0!"}},{"$f":"Eingabeblatt!Q84","v":{"$error":"#DIV/0!"}}]
[{"$f":"IF(Eingabeblatt!C85=\"\",\"\",Eingabeblatt!C85)","v":""},{"$f":"IF(Eingabeblatt!D85=\"\",\"\",Eingabeblatt!D85)","v":""},{"$f":"IF(Eingabeblatt!E85=\"\",\"\",Eingabeblatt!E85)","v":""},{"$f":"IF(Eingabeblatt!B85=\"\",\"\",Eingabeblatt!B85)","v":""},{"$f":"Eingabeblatt!R85","v":{"$error":"#DIV/0!"}},{"$f":"Eingabeblatt!Q85","v":{"$error":"#DIV/0!"}}]
[{"$f":"IF(Eingabeblatt!C86=\"\",\"\",Eingabeblatt!C86)","v":""},{"$f":"IF(Eingabeblatt!D86=\"\",\"\",Eingabeblatt!D86)","v":""},{"$f":"IF(Eingabeblatt!E86=\"\",\"\",Eingabeblatt!E86)","v":""},{"$f":"IF(Eingabeblatt!B86=\"\",\"\",Eingabeblatt!B86)","v":""},{"$f":"Eingabeblatt!R86","v":{"$error":"#DIV/0!"}},{"$f":"Eingabeblatt!Q86","v":{"$error":"#DIV/0!"}}]
[{"$f":"IF(Eingabeblatt!C87=\"\",\"\",Eingabeblatt!C87)","v":""},{"$f":"IF(Eingabeblatt!D87=\"\",\"\",Eingabeblatt!D87)","v":""},{"$f":"IF(Eingabeblatt!E87=\"\",\"\",Eingabeblatt!E87)","v":""},{"$f":"IF(Eingabeblatt!B87=\"\",\"\",Eingabeblatt!B87)","v":""},{"$f":"Eingabeblatt!R87","v":{"$error":"#DIV/0!"}},{"$f":"Eingabeblatt!Q87","v":{"$error":"#DIV/0!"}}]
[{"$f":"IF(Eingabeblatt!C88=\"\",\"\",Eingabeblatt!C88)","v":""},{"$f":"IF(Eingabeblatt!D88=\"\",\"\",Eingabeblatt!D88)","v":""},{"$f":"IF(Eingabeblatt!E88=\"\",\"\",Eingabeblatt!E88)","v":""},{"$f":"IF(Eingabeblatt!B88=\"\",\"\",Eingabeblatt!B88)","v":""},{"$f":"Eingabeblatt!R88","v":{"$error":"#DIV/0!"}},{"$f":"Eingabeblatt!Q88","v":{"$error":"#DIV/0!"}}]
[{"$f":"IF(Eingabeblatt!C89=\"\",\"\",Eingabeblatt!C89)","v":""},{"$f":"IF(Eingabeblatt!D89=\"\",\"\",Eingabeblatt!D89)","v":""},{"$f":"IF(Eingabeblatt!E89=\"\",\"\",Eingabeblatt!E89)","v":""},{"$f":"IF(Eingabeblatt!B89=\"\",\"\",Eingabeblatt!B89)","v":""},{"$f":"Eingabeblatt!R89","v":{"$error":"#DIV/0!"}},{"$f":"Eingabeblatt!Q89","v":{"$error":"#DIV/0!"}}]
[{"$f":"IF(Eingabeblatt!C90=\"\",\"\",Eingabeblatt!C90)","v":""},{"$f":"IF(Eingabeblatt!D90=\"\",\"\",Eingabeblatt!D90)","v":""},{"$f":"IF(Eingabeblatt!E90=\"\",\"\",Eingabeblatt!E90)","v":""},{"$f":"IF(Eingabeblatt!B90=\"\",\"\",Eingabeblatt!B90)","v":""},{"$f":"Eingabeblatt!R90","v":{"$error":"#DIV/0!"}},{"$f":"Eingabeblatt!Q90","v":{"$error":"#DIV/0!"}}]
[{"$f":"IF(Eingabeblatt!C91=\"\",\"\",Eingabeblatt!C91)","v":""},{"$f":"IF(Eingabeblatt!D91=\"\",\"\",Eingabeblatt!D91)","v":""},{"$f":"IF(Eingabeblatt!E91=\"\",\"\",Eingabeblatt!E91)","v":""},{"$f":"IF(Eingabeblatt!B91=\"\",\"\",Eingabeblatt!B91)","v":""},{"$f":"Eingabeblatt!R91","v":{"$error":"#DIV/0!"}},{"$f":"Eingabeblatt!Q91","v":{"$error":"#DIV/0!"}}]
[{"$f":"IF(Eingabeblatt!C92=\"\",\"\",Eingabeblatt!C92)","v":""},{"$f":"IF(Eingabeblatt!D92=\"\",\"\",Eingabeblatt!D92)","v":""},{"$f":"IF(Eingabeblatt!E92=\"\",\"\",Eingabeblatt!E92)","v":""},{"$f":"IF(Eingabeblatt!B92=\"\",\"\",Eingabeblatt!B92)","v":""},{"$f":"Eingabeblatt!R92","v":{"$error":"#DIV/0!"}},{"$f":"Eingabeblatt!Q92","v":{"$error":"#DIV/0!"}}]
[{"$f":"IF(Eingabeblatt!C93=\"\",\"\",Eingabeblatt!C93)","v":""},{"$f":"IF(Eingabeblatt!D93=\"\",\"\",Eingabeblatt!D93)","v":""},{"$f":"IF(Eingabeblatt!E93=\"\",\"\",Eingabeblatt!E93)","v":""},{"$f":"IF(Eingabeblatt!B93=\"\",\"\",Eingabeblatt!B93)","v":""},{"$f":"Eingabeblatt!R93","v":{"$error":"#DIV/0!"}},{"$f":"Eingabeblatt!Q93","v":{"$error":"#DIV/0!"}}]
[{"$f":"IF(Eingabeblatt!C94=\"\",\"\",Eingabeblatt!C94)","v":""},{"$f":"IF(Eingabeblatt!D94=\"\",\"\",Eingabeblatt!D94)","v":""},{"$f":"IF(Eingabeblatt!E94=\"\",\"\",Eingabeblatt!E94)","v":""},{"$f":"IF(Eingabeblatt!B94=\"\",\"\",Eingabeblatt!B94)","v":""},{"$f":"Eingabeblatt!R94","v":{"$error":"#DIV/0!"}},{"$f":"Eingabeblatt!Q94","v":{"$error":"#DIV/0!"}}]
[{"$f":"IF(Eingabeblatt!C95=\"\",\"\",Eingabeblatt!C95)","v":""},{"$f":"IF(Eingabeblatt!D95=\"\",\"\",Eingabeblatt!D95)","v":""},{"$f":"IF(Eingabeblatt!E95=\"\",\"\",Eingabeblatt!E95)","v":""},{"$f":"IF(Eingabeblatt!B95=\"\",\"\",Eingabeblatt!B95)","v":""},{"$f":"Eingabeblatt!R95","v":{"$error":"#DIV/0!"}},{"$f":"Eingabeblatt!Q95","v":{"$error":"#DIV/0!"}}]
[{"$f":"IF(Eingabeblatt!C96=\"\",\"\",Eingabeblatt!C96)","v":""},{"$f":"IF(Eingabeblatt!D96=\"\",\"\",Eingabeblatt!D96)","v":""},{"$f":"IF(Eingabeblatt!E96=\"\",\"\",Eingabeblatt!E96)","v":""},{"$f":"IF(Eingabeblatt!B96=\"\",\"\",Eingabeblatt!B96)","v":""},{"$f":"Eingabeblatt!R96","v":{"$error":"#DIV/0!"}},{"$f":"Eingabeblatt!Q96","v":{"$error":"#DIV/0!"}}]
[{"$f":"IF(Eingabeblatt!C97=\"\",\"\",Eingabeblatt!C97)","v":""},{"$f":"IF(Eingabeblatt!D97=\"\",\"\",Eingabeblatt!D97)","v":""},{"$f":"IF(Eingabeblatt!E97=\"\",\"\",Eingabeblatt!E97)","v":""},{"$f":"IF(Eingabeblatt!B97=\"\",\"\",Eingabeblatt!B97)","v":""},{"$f":"Eingabeblatt!R97","v":{"$error":"#DIV/0!"}},{"$f":"Eingabeblatt!Q97","v":{"$error":"#DIV/0!"}}]
[{"$f":"IF(Eingabeblatt!C98=\"\",\"\",Eingabeblatt!C98)","v":""},{"$f":"IF(Eingabeblatt!D98=\"\",\"\",Eingabeblatt!D98)","v":""},{"$f":"IF(Eingabeblatt!E98=\"\",\"\",Eingabeblatt!E98)","v":""},{"$f":"IF(Eingabeblatt!B98=\"\",\"\",Eingabeblatt!B98)","v":""},{"$f":"Eingabeblatt!R98","v":{"$error":"#DIV/0!"}},{"$f":"Eingabeblatt!Q98","v":{"$error":"#DIV/0!"}}]
[{"$f":"IF(Eingabeblatt!C99=\"\",\"\",Eingabeblatt!C99)","v":""},{"$f":"IF(Eingabeblatt!D99=\"\",\"\",Eingabeblatt!D99)","v":""},{"$f":"IF(Eingabeblatt!E99=\"\",\"\",Eingabeblatt!E99)","v":""},{"$f":"IF(Eingabeblatt!B99=\"\",\"\",Eingabeblatt!B99)","v":""},{"$f":"Eingabeblatt!R99","v":{"$error":"#DIV/0!"}},{"$f":"Eingabeblatt!Q99","v":{"$error":"#DIV/0!"}}]
[{"$f":"IF(Eingabeblatt!C100=\"\",\"\",Eingabeblatt!C100)","v":""},{"$f":"IF(Eingabeblatt!D100=\"\",\"\",Eingabeblatt!D100)","v":""},{"$f":"IF(Eingabeblatt!E100=\"\",\"\",Eingabeblatt!E100)","v":""},{"$f":"IF(Eingabeblatt!B100=\"\",\"\",Eingabeblatt!B100)","v":""},{"$f":"Eingabeblatt!R100","v":{"$error":"#DIV/0!"}},{"$f":"Eingabeblatt!Q100","v":{"$error":"#DIV/0!"}}]
[{"$f":"IF(Eingabeblatt!C101=\"\",\"\",Eingabeblatt!C101)","v":""},{"$f":"IF(Eingabeblatt!D101=\"\",\"\",Eingabeblatt!D101)","v":""},{"$f":"IF(Eingabeblatt!E101=\"\",\"\",Eingabeblatt!E101)","v":""},{"$f":"IF(Eingabeblatt!B101=\"\",\"\",Eingabeblatt!B101)","v":""},{"$f":"Eingabeblatt!R101","v":{"$error":"#DIV/0!"}},{"$f":"Eingabeblatt!Q101","v":{"$error":"#DIV/0!"}}]
[{"$f":"IF(Eingabeblatt!C102=\"\",\"\",Eingabeblatt!C102)","v":""},{"$f":"IF(Eingabeblatt!D102=\"\",\"\",Eingabeblatt!D102)","v":""},{"$f":"IF(Eingabeblatt!E102=\"\",\"\",Eingabeblatt!E102)","v":""},{"$f":"IF(Eingabeblatt!B102=\"\",\"\",Eingabeblatt!B102)","v":""},{"$f":"Eingabeblatt!R102","v":{"$error":"#DIV/0!"}},{"$f":"Eingabeblatt!Q102","v":{"$error":"#DIV/0!"}}]
[{"$f":"IF(Eingabeblatt!C103=\"\",\"\",Eingabeblatt!C103)","v":""},{"$f":"IF(Eingabeblatt!D103=\"\",\"\",Eingabeblatt!D103)","v":""},{"$f":"IF(Eingabeblatt!E103=\"\",\"\",Eingabeblatt!E103)","v":""},{"$f":"IF(Eingabeblatt!B103=\"\",\"\",Eingabeblatt!B103)","v":""},{"$f":"Eingabeblatt!R103","v":{"$error":"#DIV/0!"}},{"$f":"Eingabeblatt!Q103","v":{"$error":"#DIV/0!"}}]
[{"$f":"IF(Eingabeblatt!C104=\"\",\"\",Eingabeblatt!C104)","v":""},{"$f":"IF(Eingabeblatt!D104=\"\",\"\",Eingabeblatt!D104)","v":""},{"$f":"IF(Eingabeblatt!E104=\"\",\"\",Eingabeblatt!E104)","v":""},{"$f":"IF(Eingabeblatt!B104=\"\",\"\",Eingabeblatt!B104)","v":""},{"$f":"Eingabeblatt!R104","v":{"$error":"#DIV/0!"}},{"$f":"Eingabeblatt!Q104","v":{"$error":"#DIV/0!"}}]
[{"$f":"IF(Eingabeblatt!C105=\"\",\"\",Eingabeblatt!C105)","v":""},{"$f":"IF(Eingabeblatt!D105=\"\",\"\",Eingabeblatt!D105)","v":""},{"$f":"IF(Eingabeblatt!E105=\"\",\"\",Eingabeblatt!E105)","v":""},{"$f":"IF(Eingabeblatt!B105=\"\",\"\",Eingabeblatt!B105)","v":""},{"$f":"Eingabeblatt!R105","v":{"$error":"#DIV/0!"}},{"$f":"Eingabeblatt!Q105","v":{"$error":"#DIV/0!"}}]
[{"$f":"IF(Eingabeblatt!C106=\"\",\"\",Eingabeblatt!C106)","v":""},{"$f":"IF(Eingabeblatt!D106=\"\",\"\",Eingabeblatt!D106)","v":""},{"$f":"IF(Eingabeblatt!E106=\"\",\"\",Eingabeblatt!E106)","v":""},{"$f":"IF(Eingabeblatt!B106=\"\",\"\",Eingabeblatt!B106)","v":""},{"$f":"Eingabeblatt!R106","v":{"$error":"#DIV/0!"}},{"$f":"Eingabeblatt!Q106","v":{"$error":"#DIV/0!"}}]
[{"$f":"IF(Eingabeblatt!C107=\"\",\"\",Eingabeblatt!C107)","v":""},{"$f":"IF(Eingabeblatt!D107=\"\",\"\",Eingabeblatt!D107)","v":""},{"$f":"IF(Eingabeblatt!E107=\"\",\"\",Eingabeblatt!E107)","v":""},{"$f":"IF(Eingabeblatt!B107=\"\",\"\",Eingabeblatt!B107)","v":""},{"$f":"Eingabeblatt!R107","v":{"$error":"#DIV/0!"}},{"$f":"Eingabeblatt!Q107","v":{"$error":"#DIV/0!"}}]
[{"$f":"IF(Eingabeblatt!C108=\"\",\"\",Eingabeblatt!C108)","v":""},{"$f":"IF(Eingabeblatt!D108=\"\",\"\",Eingabeblatt!D108)","v":""},{"$f":"IF(Eingabeblatt!E108=\"\",\"\",Eingabeblatt!E108)","v":""},{"$f":"IF(Eingabeblatt!B108=\"\",\"\",Eingabeblatt!B108)","v":""},{"$f":"Eingabeblatt!R108","v":{"$error":"#DIV/0!"}},{"$f":"Eingabeblatt!Q108","v":{"$error":"#DIV/0!"}}]
[{"$f":"IF(Eingabeblatt!C109=\"\",\"\",Eingabeblatt!C109)","v":""},{"$f":"IF(Eingabeblatt!D109=\"\",\"\",Eingabeblatt!D109)","v":""},{"$f":"IF(Eingabeblatt!E109=\"\",\"\",Eingabeblatt!E109)","v":""},{"$f":"IF(Eingabeblatt!B109=\"\",\"\",Eingabeblatt!B109)","v":""},{"$f":"Eingabeblatt!R109","v":{"$error":"#DIV/0!"}},{"$f":"Eingabeblatt!Q109","v":{"$error":"#DIV/0!"}}]
[{"$f":"IF(Eingabeblatt!C110=\"\",\"\",Eingabeblatt!C110)","v":""},{"$f":"IF(Eingabeblatt!D110=\"\",\"\",Eingabeblatt!D110)","v":""},{"$f":"IF(Eingabeblatt!E110=\"\",\"\",Eingabeblatt!E110)","v":""},{"$f":"IF(Eingabeblatt!B110=\"\",\"\",Eingabeblatt!B110)","v":""},{"$f":"Eingabeblatt!R110","v":{"$error":"#DIV/0!"}},{"$f":"Eingabeblatt!Q110","v":{"$error":"#DIV/0!"}}]
[{"$f":"IF(Eingabeblatt!C111=\"\",\"\",Eingabeblatt!C111)","v":""},{"$f":"IF(Eingabeblatt!D111=\"\",\"\",Eingabeblatt!D111)","v":""},{"$f":"IF(Eingabeblatt!E111=\"\",\"\",Eingabeblatt!E111)","v":""},{"$f":"IF(Eingabeblatt!B111=\"\",\"\",Eingabeblatt!B111)","v":""},{"$f":"Eingabeblatt!R111","v":{"$error":"#DIV/0!"}},{"$f":"Eingabeblatt!Q111","v":{"$error":"#DIV/0!"}}]
[{"$f":"IF(Eingabeblatt!C112=\"\",\"\",Eingabeblatt!C112)","v":""},{"$f":"IF(Eingabeblatt!D112=\"\",\"\",Eingabeblatt!D112)","v":""},{"$f":"IF(Eingabeblatt!E112=\"\",\"\",Eingabeblatt!E112)","v":""},{"$f":"IF(Eingabeblatt!B112=\"\",\"\",Eingabeblatt!B112)","v":""},{"$f":"Eingabeblatt!R112","v":{"$error":"#DIV/0!"}},{"$f":"Eingabeblatt!Q112","v":{"$error":"#DIV/0!"}}]
[{"$f":"IF(Eingabeblatt!C113=\"\",\"\",Eingabeblatt!C113)","v":""},{"$f":"IF(Eingabeblatt!D113=\"\",\"\",Eingabeblatt!D113)","v":""},{"$f":"IF(Eingabeblatt!E113=\"\",\"\",Eingabeblatt!E113)","v":""},{"$f":"IF(Eingabeblatt!B113=\"\",\"\",Eingabeblatt!B113)","v":""},{"$f":"Eingabeblatt!R113","v":{"$error":"#DIV/0!"}},{"$f":"Eingabeblatt!Q113","v":{"$error":"#DIV/0!"}}]
[{"$f":"IF(Eingabeblatt!C114=\"\",\"\",Eingabeblatt!C114)","v":""},{"$f":"IF(Eingabeblatt!D114=\"\",\"\",Eingabeblatt!D114)","v":""},{"$f":"IF(Eingabeblatt!E114=\"\",\"\",Eingabeblatt!E114)","v":""},{"$f":"IF(Eingabeblatt!B114=\"\",\"\",Eingabeblatt!B114)","v":""},{"$f":"Eingabeblatt!R114","v":{"$error":"#DIV/0!"}},{"$f":"Eingabeblatt!Q114","v":{"$error":"#DIV/0!"}}]
[{"$f":"IF(Eingabeblatt!C115=\"\",\"\",Eingabeblatt!C115)","v":""},{"$f":"IF(Eingabeblatt!D115=\"\",\"\",Eingabeblatt!D115)","v":""},{"$f":"IF(Eingabeblatt!E115=\"\",\"\",Eingabeblatt!E115)","v":""},{"$f":"IF(Eingabeblatt!B115=\"\",\"\",Eingabeblatt!B115)","v":""},{"$f":"Eingabeblatt!R115","v":{"$error":"#DIV/0!"}},{"$f":"Eingabeblatt!Q115","v":{"$error":"#DIV/0!"}}]
[{"$f":"IF(Eingabeblatt!C116=\"\",\"\",Eingabeblatt!C116)","v":""},{"$f":"IF(Eingabeblatt!D116=\"\",\"\",Eingabeblatt!D116)","v":""},{"$f":"IF(Eingabeblatt!E116=\"\",\"\",Eingabeblatt!E116)","v":""},{"$f":"IF(Eingabeblatt!B116=\"\",\"\",Eingabeblatt!B116)","v":""},{"$f":"Eingabeblatt!R116","v":{"$error":"#DIV/0!"}},{"$f":"Eingabeblatt!Q116","v":{"$error":"#DIV/0!"}}]
[{"$f":"IF(Eingabeblatt!C117=\"\",\"\",Eingabeblatt!C117)","v":""},{"$f":"IF(Eingabeblatt!D117=\"\",\"\",Eingabeblatt!D117)","v":""},{"$f":"IF(Eingabeblatt!E117=\"\",\"\",Eingabeblatt!E117)","v":""},{"$f":"IF(Eingabeblatt!B117=\"\",\"\",Eingabeblatt!B117)","v":""},{"$f":"Eingabeblatt!R117","v":{"$error":"#DIV/0!"}},{"$f":"Eingabeblatt!Q117","v":{"$error":"#DIV/0!"}}]
[{"$f":"IF(Eingabeblatt!C118=\"\",\"\",Eingabeblatt!C118)","v":""},{"$f":"IF(Eingabeblatt!D118=\"\",\"\",Eingabeblatt!D118)","v":""},{"$f":"IF(Eingabeblatt!E118=\"\",\"\",Eingabeblatt!E118)","v":""},{"$f":"IF(Eingabeblatt!B118=\"\",\"\",Eingabeblatt!B118)","v":""},{"$f":"Eingabeblatt!R118","v":{"$error":"#DIV/0!"}},{"$f":"Eingabeblatt!Q118","v":{"$error":"#DIV/0!"}}]
[{"$f":"IF(Eingabeblatt!C119=\"\",\"\",Eingabeblatt!C119)","v":""},{"$f":"IF(Eingabeblatt!D119=\"\",\"\",Eingabeblatt!D119)","v":""},{"$f":"IF(Eingabeblatt!E119=\"\",\"\",Eingabeblatt!E119)","v":""},{"$f":"IF(Eingabeblatt!B119=\"\",\"\",Eingabeblatt!B119)","v":""},{"$f":"Eingabeblatt!R119","v":{"$error":"#DIV/0!"}},{"$f":"Eingabeblatt!Q119","v":{"$error":"#DIV/0!"}}]
[{"$f":"IF(Eingabeblatt!C120=\"\",\"\",Eingabeblatt!C120)","v":""},{"$f":"IF(Eingabeblatt!D120=\"\",\"\",Eingabeblatt!D120)","v":""},{"$f":"IF(Eingabeblatt!E120=\"\",\"\",Eingabeblatt!E120)","v":""},{"$f":"IF(Eingabeblatt!B120=\"\",\"\",Eingabeblatt!B120)","v":""},{"$f":"Eingabeblatt!R120","v":{"$error":"#DIV/0!"}},{"$f":"Eingabeblatt!Q120","v":{"$error":"#DIV/0!"}}]
[{"$f":"IF(Eingabeblatt!C121=\"\",\"\",Eingabeblatt!C121)","v":""},{"$f":"IF(Eingabeblatt!D121=\"\",\"\",Eingabeblatt!D121)","v":""},{"$f":"IF(Eingabeblatt!E121=\"\",\"\",Eingabeblatt!E121)","v":""},{"$f":"IF(Eingabeblatt!B121=\"\",\"\",Eingabeblatt!B121)","v":""},{"$f":"Eingabeblatt!R121","v":{"$error":"#DIV/0!"}},{"$f":"Eingabeblatt!Q121","v":{"$error":"#DIV/0!"}}]
[{"$f":"IF(Eingabeblatt!C122=\"\",\"\",Eingabeblatt!C122)","v":""},{"$f":"IF(Eingabeblatt!D122=\"\",\"\",Eingabeblatt!D122)","v":""},{"$f":"IF(Eingabeblatt!E122=\"\",\"\",Eingabeblatt!E122)","v":""},{"$f":"IF(Eingabeblatt!B122=\"\",\"\",Eingabeblatt!B122)","v":""},{"$f":"Eingabeblatt!R122","v":{"$error":"#DIV/0!"}},{"$f":"Eingabeblatt!Q122","v":{"$error":"#DIV/0!"}}]
[{"$f":"IF(Eingabeblatt!C123=\"\",\"\",Eingabeblatt!C123)","v":""},{"$f":"IF(Eingabeblatt!D123=\"\",\"\",Eingabeblatt!D123)","v":""},{"$f":"IF(Eingabeblatt!E123=\"\",\"\",Eingabeblatt!E123)","v":""},{"$f":"IF(Eingabeblatt!B123=\"\",\"\",Eingabeblatt!B123)","v":""},{"$f":"Eingabeblatt!R123","v":{"$error":"#DIV/0!"}},{"$f":"Eingabeblatt!Q123","v":{"$error":"#DIV/0!"}}]
[{"$f":"IF(Eingabeblatt!C124=\"\",\"\",Eingabeblatt!C124)","v":""},{"$f":"IF(Eingabeblatt!D124=\"\",\"\",Eingabeblatt!D124)","v":""},{"$f":"IF(Eingabeblatt!E124=\"\",\"\",Eingabeblatt!E124)","v":""},{"$f":"IF(Eingabeblatt!B124=\"\",\"\",Eingabeblatt!B124)","v":""},{"$f":"Eingabeblatt!R124","v":{"$error":"#DIV/0!"}},{"$f":"Eingabeblatt!Q124","v":{"$error":"#DIV/0!"}}]
[{"$f":"IF(Eingabeblatt!C125=\"\",\"\",Eingabeblatt!C125)","v":""},{"$f":"IF(Eingabeblatt!D125=\"\",\"\",Eingabeblatt!D125)","v":""},{"$f":"IF(Eingabeblatt!E125=\"\",\"\",Eingabeblatt!E125)","v":""},{"$f":"IF(Eingabeblatt!B125=\"\",\"\",Eingabeblatt!B125)","v":""},{"$f":"Eingabeblatt!R125","v":{"$error":"#DIV/0!"}},{"$f":"Eingabeblatt!Q125","v":{"$error":"#DIV/0!"}}]
[{"$f":"IF(Eingabeblatt!C126=\"\",\"\",Eingabeblatt!C126)","v":""},{"$f":"IF(Eingabeblatt!D126=\"\",\"\",Eingabeblatt!D126)","v":""},{"$f":"IF(Eingabeblatt!E126=\"\",\"\",Eingabeblatt!E126)","v":""},{"$f":"IF(Eingabeblatt!B126=\"\",\"\",Eingabeblatt!B126)","v":""},{"$f":"Eingabeblatt!R126","v":{"$error":"#DIV/0!"}},{"$f":"Eingabeblatt!Q126","v":{"$error":"#DIV/0!"}}]
[{"$f":"IF(Eingabeblatt!C127=\"\",\"\",Eingabeblatt!C127)","v":""},{"$f":"IF(Eingabeblatt!D127=\"\",\"\",Eingabeblatt!D127)","v":""},{"$f":"IF(Eingabeblatt!E127=\"\",\"\",Eingabeblatt!E127)","v":""},{"$f":"IF(Eingabeblatt!B127=\"\",\"\",Eingabeblatt!B127)","v":""},{"$f":"Eingabeblatt!R127","v":{"$error":"#DIV/0!"}},{"$f":"Eingabeblatt!Q127","v":{"$error":"#DIV/0!"}}]
[{"$f":"IF(Eingabeblatt!C128=\"\",\"\",Eingabeblatt!C128)","v":""},{"$f":"IF(Eingabeblatt!D128=\"\",\"\",Eingabeblatt!D128)","v":""},{"$f":"IF(Eingabeblatt!E128=\"\",\"\",Eingabeblatt!E128)","v":""},{"$f":"IF(Eingabeblatt!B128=\"\",\"\",Eingabeblatt!B128)","v":""},{"$f":"Eingabeblatt!R128","v":{"$error":"#DIV/0!"}},{"$f":"Eingabeblatt!Q128","v":{"$error":"#DIV/0!"}}]
[{"$f":"IF(Eingabeblatt!C129=\"\",\"\",Eingabeblatt!C129)","v":""},{"$f":"IF(Eingabeblatt!D129=\"\",\"\",Eingabeblatt!D129)","v":""},{"$f":"IF(Eingabeblatt!E129=\"\",\"\",Eingabeblatt!E129)","v":""},{"$f":"IF(Eingabeblatt!B129=\"\",\"\",Eingabeblatt!B129)","v":""},{"$f":"Eingabeblatt!R129","v":{"$error":"#DIV/0!"}},{"$f":"Eingabeblatt!Q129","v":{"$error":"#DIV/0!"}}]
[{"$f":"IF(Eingabeblatt!C130=\"\",\"\",Eingabeblatt!C130)","v":""},{"$f":"IF(Eingabeblatt!D130=\"\",\"\",Eingabeblatt!D130)","v":""},{"$f":"IF(Eingabeblatt!E130=\"\",\"\",Eingabeblatt!E130)","v":""},{"$f":"IF(Eingabeblatt!B130=\"\",\"\",Eingabeblatt!B130)","v":""},{"$f":"Eingabeblatt!R130","v":{"$error":"#DIV/0!"}},{"$f":"Eingabeblatt!Q130","v":{"$error":"#DIV/0!"}}]
[{"$f":"IF(Eingabeblatt!C131=\"\",\"\",Eingabeblatt!C131)","v":""},{"$f":"IF(Eingabeblatt!D131=\"\",\"\",Eingabeblatt!D131)","v":""},{"$f":"IF(Eingabeblatt!E131=\"\",\"\",Eingabeblatt!E131)","v":""},{"$f":"IF(Eingabeblatt!B131=\"\",\"\",Eingabeblatt!B131)","v":""},{"$f":"Eingabeblatt!R131","v":{"$error":"#DIV/0!"}},{"$f":"Eingabeblatt!Q131","v":{"$error":"#DIV/0!"}}]
[{"$f":"IF(Eingabeblatt!C132=\"\",\"\",Eingabeblatt!C132)","v":""},{"$f":"IF(Eingabeblatt!D132=\"\",\"\",Eingabeblatt!D132)","v":""},{"$f":"IF(Eingabeblatt!E132=\"\",\"\",Eingabeblatt!E132)","v":""},{"$f":"IF(Eingabeblatt!B132=\"\",\"\",Eingabeblatt!B132)","v":""},{"$f":"Eingabeblatt!R132","v":{"$error":"#DIV/0!"}},{"$f":"Eingabeblatt!Q132","v":{"$error":"#DIV/0!"}}]
[{"$f":"IF(Eingabeblatt!C133=\"\",\"\",Eingabeblatt!C133)","v":""},{"$f":"IF(Eingabeblatt!D133=\"\",\"\",Eingabeblatt!D133)","v":""},{"$f":"IF(Eingabeblatt!E133=\"\",\"\",Eingabeblatt!E133)","v":""},{"$f":"IF(Eingabeblatt!B133=\"\",\"\",Eingabeblatt!B133)","v":""},{"$f":"Eingabeblatt!R133","v":{"$error":"#DIV/0!"}},{"$f":"Eingabeblatt!Q133","v":{"$error":"#DIV/0!"}}]
[{"$f":"IF(Eingabeblatt!C134=\"\",\"\",Eingabeblatt!C134)","v":""},{"$f":"IF(Eingabeblatt!D134=\"\",\"\",Eingabeblatt!D134)","v":""},{"$f":"IF(Eingabeblatt!E134=\"\",\"\",Eingabeblatt!E134)","v":""},{"$f":"IF(Eingabeblatt!B134=\"\",\"\",Eingabeblatt!B134)","v":""},{"$f":"Eingabeblatt!R134","v":{"$error":"#DIV/0!"}},{"$f":"Eingabeblatt!Q134","v":{"$error":"#DIV/0!"}}]
[{"$f":"IF(Eingabeblatt!C135=\"\",\"\",Eingabeblatt!C135)","v":""},{"$f":"IF(Eingabeblatt!D135=\"\",\"\",Eingabeblatt!D135)","v":""},{"$f":"IF(Eingabeblatt!E135=\"\",\"\",Eingabeblatt!E135)","v":""},{"$f":"IF(Eingabeblatt!B135=\"\",\"\",Eingabeblatt!B135)","v":""},{"$f":"Eingabeblatt!R135","v":{"$error":"#DIV/0!"}},{"$f":"Eingabeblatt!Q135","v":{"$error":"#DIV/0!"}}]
[{"$f":"IF(Eingabeblatt!C136=\"\",\"\",Eingabeblatt!C136)","v":""},{"$f":"IF(Eingabeblatt!D136=\"\",\"\",Eingabeblatt!D136)","v":""},{"$f":"IF(Eingabeblatt!E136=\"\",\"\",Eingabeblatt!E136)","v":""},{"$f":"IF(Eingabeblatt!B136=\"\",\"\",Eingabeblatt!B136)","v":""},{"$f":"Eingabeblatt!R136","v":{"$error":"#DIV/0!"}},{"$f":"Eingabeblatt!Q136","v":{"$error":"#DIV/0!"}}]
[{"$f":"IF(Eingabeblatt!C137=\"\",\"\",Eingabeblatt!C137)","v":""},{"$f":"IF(Eingabeblatt!D137=\"\",\"\",Eingabeblatt!D137)","v":""},{"$f":"IF(Eingabeblatt!E137=\"\",\"\",Eingabeblatt!E137)","v":""},{"$f":"IF(Eingabeblatt!B137=\"\",\"\",Eingabeblatt!B137)","v":""},{"$f":"Eingabeblatt!R137","v":{"$error":"#DIV/0!"}},{"$f":"Eingabeblatt!Q137","v":{"$error":"#DIV/0!"}}]
[{"$f":"IF(Eingabeblatt!C138=\"\",\"\",Eingabeblatt!C138)","v":""},{"$f":"IF(Eingabeblatt!D138=\"\",\"\",Eingabeblatt!D138)","v":""},{"$f":"IF(Eingabeblatt!E138=\"\",\"\",Eingabeblatt!E138)","v":""},{"$f":"IF(Eingabeblatt!B138=\"\",\"\",Eingabeblatt!B138)","v":""},{"$f":"Eingabeblatt!R138","v":{"$error":"#DIV/0!"}},{"$f":"Eingabeblatt!Q138","v":{"$error":"#DIV/0!"}}]
[{"$f":"IF(Eingabeblatt!C139=\"\",\"\",Eingabeblatt!C139)","v":""},{"$f":"IF(Eingabeblatt!D139=\"\",\"\",Eingabeblatt!D139)","v":""},{"$f":"IF(Eingabeblatt!E139=\"\",\"\",Eingabeblatt!E139)","v":""},{"$f":"IF(Eingabeblatt!B139=\"\",\"\",Eingabeblatt!B139)","v":""},{"$f":"Eingabeblatt!R139","v":{"$error":"#DIV/0!"}},{"$f":"Eingabeblatt!Q139","v":{"$error":"#DIV/0!"}}]
[{"$f":"IF(Eingabeblatt!C140=\"\",\"\",Eingabeblatt!C140)","v":""},{"$f":"IF(Eingabeblatt!D140=\"\",\"\",Eingabeblatt!D140)","v":""},{"$f":"IF(Eingabeblatt!E140=\"\",\"\",Eingabeblatt!E140)","v":""},{"$f":"IF(Eingabeblatt!B140=\"\",\"\",Eingabeblatt!B140)","v":""},{"$f":"Eingabeblatt!R140","v":{"$error":"#DIV/0!"}},{"$f":"Eingabeblatt!Q140","v":{"$error":"#DIV/0!"}}]
[{"$f":"IF(Eingabeblatt!C141=\"\",\"\",Eingabeblatt!C141)","v":""},{"$f":"IF(Eingabeblatt!D141=\"\",\"\",Eingabeblatt!D141)","v":""},{"$f":"IF(Eingabeblatt!E141=\"\",\"\",Eingabeblatt!E141)","v":""},{"$f":"IF(Eingabeblatt!B141=\"\",\"\",Eingabeblatt!B141)","v":""},{"$f":"Eingabeblatt!R141","v":{"$error":"#DIV/0!"}},{"$f":"Eingabeblatt!Q141","v":{"$error":"#DIV/0!"}}]
[{"$f":"IF(Eingabeblatt!C142=\"\",\"\",Eingabeblatt!C142)","v":""},{"$f":"IF(Eingabeblatt!D142=\"\",\"\",Eingabeblatt!D142)","v":""},{"$f":"IF(Eingabeblatt!E142=\"\",\"\",Eingabeblatt!E142)","v":""},{"$f":"IF(Eingabeblatt!B142=\"\",\"\",Eingabeblatt!B142)","v":""},{"$f":"Eingabeblatt!R142","v":{"$error":"#DIV/0!"}},{"$f":"Eingabeblatt!Q142","v":{"$error":"#DIV/0!"}}]
[{"$f":"IF(Eingabeblatt!C143=\"\",\"\",Eingabeblatt!C143)","v":""},{"$f":"IF(Eingabeblatt!D143=\"\",\"\",Eingabeblatt!D143)","v":""},{"$f":"IF(Eingabeblatt!E143=\"\",\"\",Eingabeblatt!E143)","v":""},{"$f":"IF(Eingabeblatt!B143=\"\",\"\",Eingabeblatt!B143)","v":""},{"$f":"Eingabeblatt!R143","v":{"$error":"#DIV/0!"}},{"$f":"Eingabeblatt!Q143","v":{"$error":"#DIV/0!"}}]
[{"$f":"IF(Eingabeblatt!C144=\"\",\"\",Eingabeblatt!C144)","v":""},{"$f":"IF(Eingabeblatt!D144=\"\",\"\",Eingabeblatt!D144)","v":""},{"$f":"IF(Eingabeblatt!E144=\"\",\"\",Eingabeblatt!E144)","v":""},{"$f":"IF(Eingabeblatt!B144=\"\",\"\",Eingabeblatt!B144)","v":""},{"$f":"Eingabeblatt!R144","v":{"$error":"#DIV/0!"}},{"$f":"Eingabeblatt!Q144","v":{"$error":"#DIV/0!"}}]
[{"$f":"IF(Eingabeblatt!C145=\"\",\"\",Eingabeblatt!C145)","v":""},{"$f":"IF(Eingabeblatt!D145=\"\",\"\",Eingabeblatt!D145)","v":""},{"$f":"IF(Eingabeblatt!E145=\"\",\"\",Eingabeblatt!E145)","v":""},{"$f":"IF(Eingabeblatt!B145=\"\",\"\",Eingabeblatt!B145)","v":""},{"$f":"Eingabeblatt!R145","v":{"$error":"#DIV/0!"}},{"$f":"Eingabeblatt!Q145","v":{"$error":"#DIV/0!"}}]
[{"$f":"IF(Eingabeblatt!C146=\"\",\"\",Eingabeblatt!C146)","v":""},{"$f":"IF(Eingabeblatt!D146=\"\",\"\",Eingabeblatt!D146)","v":""},{"$f":"IF(Eingabeblatt!E146=\"\",\"\",Eingabeblatt!E146)","v":""},{"$f":"IF(Eingabeblatt!B146=\"\",\"\",Eingabeblatt!B146)","v":""},{"$f":"Eingabeblatt!R146","v":{"$error":"#DIV/0!"}},{"$f":"Eingabeblatt!Q146","v":{"$error":"#DIV/0!"}}]
[{"$f":"IF(Eingabeblatt!C147=\"\",\"\",Eingabeblatt!C147)","v":""},{"$f":"IF(Eingabeblatt!D147=\"\",\"\",Eingabeblatt!D147)","v":""},{"$f":"IF(Eingabeblatt!E147=\"\",\"\",Eingabeblatt!E147)","v":""},{"$f":"IF(Eingabeblatt!B147=\"\",\"\",Eingabeblatt!B147)","v":""},{"$f":"Eingabeblatt!R147","v":{"$error":"#DIV/0!"}},{"$f":"Eingabeblatt!Q147","v":{"$error":"#DIV/0!"}}]
[{"$f":"IF(Eingabeblatt!C148=\"\",\"\",Eingabeblatt!C148)","v":""},{"$f":"IF(Eingabeblatt!D148=\"\",\"\",Eingabeblatt!D148)","v":""},{"$f":"IF(Eingabeblatt!E148=\"\",\"\",Eingabeblatt!E148)","v":""},{"$f":"IF(Eingabeblatt!B148=\"\",\"\",Eingabeblatt!B148)","v":""},{"$f":"Eingabeblatt!R148","v":{"$error":"#DIV/0!"}},{"$f":"Eingabeblatt!Q148","v":{"$error":"#DIV/0!"}}]
[{"$f":"IF(Eingabeblatt!C149=\"\",\"\",Eingabeblatt!C149)","v":""},{"$f":"IF(Eingabeblatt!D149=\"\",\"\",Eingabeblatt!D149)","v":""},{"$f":"IF(Eingabeblatt!E149=\"\",\"\",Eingabeblatt!E149)","v":""},{"$f":"IF(Eingabeblatt!B149=\"\",\"\",Eingabeblatt!B149)","v":""},{"$f":"Eingabeblatt!R149","v":{"$error":"#DIV/0!"}},{"$f":"Eingabeblatt!Q149","v":{"$error":"#DIV/0!"}}]
[{"$f":"IF(Eingabeblatt!C150=\"\",\"\",Eingabeblatt!C150)","v":""},{"$f":"IF(Eingabeblatt!D150=\"\",\"\",Eingabeblatt!D150)","v":""},{"$f":"IF(Eingabeblatt!E150=\"\",\"\",Eingabeblatt!E150)","v":""},{"$f":"IF(Eingabeblatt!B150=\"\",\"\",Eingabeblatt!B150)","v":""},{"$f":"Eingabeblatt!R150","v":{"$error":"#DIV/0!"}},{"$f":"Eingabeblatt!Q150","v":{"$error":"#DIV/0!"}}]
[{"$f":"IF(Eingabeblatt!C151=\"\",\"\",Eingabeblatt!C151)","v":""},{"$f":"IF(Eingabeblatt!D151=\"\",\"\",Eingabeblatt!D151)","v":""},{"$f":"IF(Eingabeblatt!E151=\"\",\"\",Eingabeblatt!E151)","v":""},{"$f":"IF(Eingabeblatt!B151=\"\",\"\",Eingabeblatt!B151)","v":""},{"$f":"Eingabeblatt!R151","v":{"$error":"#DIV/0!"}},{"$f":"Eingabeblatt!Q151","v":{"$error":"#DIV/0!"}}]
[{"$f":"IF(Eingabeblatt!C152=\"\",\"\",Eingabeblatt!C152)","v":""},{"$f":"IF(Eingabeblatt!D152=\"\",\"\",Eingabeblatt!D152)","v":""},{"$f":"IF(Eingabeblatt!E152=\"\",\"\",Eingabeblatt!E152)","v":""},{"$f":"IF(Eingabeblatt!B152=\"\",\"\",Eingabeblatt!B152)","v":""},{"$f":"Eingabeblatt!R152","v":{"$error":"#DIV/0!"}},{"$f":"Eingabeblatt!Q152","v":{"$error":"#DIV/0!"}}]
[{"$f":"IF(Eingabeblatt!C153=\"\",\"\",Eingabeblatt!C153)","v":""},{"$f":"IF(Eingabeblatt!D153=\"\",\"\",Eingabeblatt!D153)","v":""},{"$f":"IF(Eingabeblatt!E153=\"\",\"\",Eingabeblatt!E153)","v":""},{"$f":"IF(Eingabeblatt!B153=\"\",\"\",Eingabeblatt!B153)","v":""},{"$f":"Eingabeblatt!R153","v":{"$error":"#DIV/0!"}},{"$f":"Eingabeblatt!Q153","v":{"$error":"#DIV/0!"}}]
[{"$f":"IF(Eingabeblatt!C154=\"\",\"\",Eingabeblatt!C154)","v":""},{"$f":"IF(Eingabeblatt!D154=\"\",\"\",Eingabeblatt!D154)","v":""},{"$f":"IF(Eingabeblatt!E154=\"\",\"\",Eingabeblatt!E154)","v":""},{"$f":"IF(Eingabeblatt!B154=\"\",\"\",Eingabeblatt!B154)","v":""},{"$f":"Eingabeblatt!R154","v":{"$error":"#DIV/0!"}},{"$f":"Eingabeblatt!Q154","v":{"$error":"#DIV/0!"}}]
[{"$f":"IF(Eingabeblatt!C155=\"\",\"\",Eingabeblatt!C155)","v":""},{"$f":"IF(Eingabeblatt!D155=\"\",\"\",Eingabeblatt!D155)","v":""},{"$f":"IF(Eingabeblatt!E155=\"\",\"\",Eingabeblatt!E155)","v":""},{"$f":"IF(Eingabeblatt!B155=\"\",\"\",Eingabeblatt!B155)","v":""},{"$f":"Eingabeblatt!R155","v":{"$error":"#DIV/0!"}},{"$f":"Eingabeblatt!Q155","v":{"$error":"#DIV/0!"}}]
[{"$f":"IF(Eingabeblatt!C156=\"\",\"\",Eingabeblatt!C156)","v":""},{"$f":"IF(Eingabeblatt!D156=\"\",\"\",Eingabeblatt!D156)","v":""},{"$f":"IF(Eingabeblatt!E156=\"\",\"\",Eingabeblatt!E156)","v":""},{"$f":"IF(Eingabeblatt!B156=\"\",\"\",Eingabeblatt!B156)","v":""},{"$f":"Eingabeblatt!R156","v":{"$error":"#DIV/0!"}},{"$f":"Eingabeblatt!Q156","v":{"$error":"#DIV/0!"}}]
[{"$f":"IF(Eingabeblatt!C157=\"\",\"\",Eingabeblatt!C157)","v":""},{"$f":"IF(Eingabeblatt!D157=\"\",\"\",Eingabeblatt!D157)","v":""},{"$f":"IF(Eingabeblatt!E157=\"\",\"\",Eingabeblatt!E157)","v":""},{"$f":"IF(Eingabeblatt!B157=\"\",\"\",Eingabeblatt!B157)","v":""},{"$f":"Eingabeblatt!R157","v":{"$error":"#DIV/0!"}},{"$f":"Eingabeblatt!Q157","v":{"$error":"#DIV/0!"}}]
[{"$f":"IF(Eingabeblatt!C158=\"\",\"\",Eingabeblatt!C158)","v":""},{"$f":"IF(Eingabeblatt!D158=\"\",\"\",Eingabeblatt!D158)","v":""},{"$f":"IF(Eingabeblatt!E158=\"\",\"\",Eingabeblatt!E158)","v":""},{"$f":"IF(Eingabeblatt!B158=\"\",\"\",Eingabeblatt!B158)","v":""},{"$f":"Eingabeblatt!R158","v":{"$error":"#DIV/0!"}},{"$f":"Eingabeblatt!Q158","v":{"$error":"#DIV/0!"}}]
[{"$f":"IF(Eingabeblatt!C159=\"\",\"\",Eingabeblatt!C159)","v":""},{"$f":"IF(Eingabeblatt!D159=\"\",\"\",Eingabeblatt!D159)","v":""},{"$f":"IF(Eingabeblatt!E159=\"\",\"\",Eingabeblatt!E159)","v":""},{"$f":"IF(Eingabeblatt!B159=\"\",\"\",Eingabeblatt!B159)","v":""},{"$f":"Eingabeblatt!R159","v":{"$error":"#DIV/0!"}},{"$f":"Eingabeblatt!Q159","v":{"$error":"#DIV/0!"}}]
[{"$f":"IF(Eingabeblatt!C160=\"\",\"\",Eingabeblatt!C160)","v":""},{"$f":"IF(Eingabeblatt!D160=\"\",\"\",Eingabeblatt!D160)","v":""},{"$f":"IF(Eingabeblatt!E160=\"\",\"\",Eingabeblatt!E160)","v":""},{"$f":"IF(Eingabeblatt!B160=\"\",\"\",Eingabeblatt!B160)","v":""},{"$f":"Eingabeblatt!R160","v":{"$error":"#DIV/0!"}},{"$f":"Eingabeblatt!Q160","v":{"$error":"#DIV/0!"}}]
[{"$f":"IF(Eingabeblatt!C161=\"\",\"\",Eingabeblatt!C161)","v":""},{"$f":"IF(Eingabeblatt!D161=\"\",\"\",Eingabeblatt!D161)","v":""},{"$f":"IF(Eingabeblatt!E161=\"\",\"\",Eingabeblatt!E161)","v":""},{"$f":"IF(Eingabeblatt!B161=\"\",\"\",Eingabeblatt!B161)","v":""},{"$f":"Eingabeblatt!R161","v":{"$error":"#DIV/0!"}},{"$f":"Eingabeblatt!Q161","v":{"$error":"#DIV/0!"}}]
[{"$f":"IF(Eingabeblatt!C162=\"\",\"\",Eingabeblatt!C162)","v":""},{"$f":"IF(Eingabeblatt!D162=\"\",\"\",Eingabeblatt!D162)","v":""},{"$f":"IF(Eingabeblatt!E162=\"\",\"\",Eingabeblatt!E162)","v":""},{"$f":"IF(Eingabeblatt!B162=\"\",\"\",Eingabeblatt!B162)","v":""},{"$f":"Eingabeblatt!R162","v":{"$error":"#DIV/0!"}},{"$f":"Eingabeblatt!Q162","v":{"$error":"#DIV/0!"}}]
[{"$f":"IF(Eingabeblatt!C163=\"\",\"\",Eingabeblatt!C163)","v":""},{"$f":"IF(Eingabeblatt!D163=\"\",\"\",Eingabeblatt!D163)","v":""},{"$f":"IF(Eingabeblatt!E163=\"\",\"\",Eingabeblatt!E163)","v":""},{"$f":"IF(Eingabeblatt!B163=\"\",\"\",Eingabeblatt!B163)","v":""},{"$f":"Eingabeblatt!R163","v":{"$error":"#DIV/0!"}},{"$f":"Eingabeblatt!Q163","v":{"$error":"#DIV/0!"}}]
[{"$f":"IF(Eingabeblatt!C164=\"\",\"\",Eingabeblatt!C164)","v":""},{"$f":"IF(Eingabeblatt!D164=\"\",\"\",Eingabeblatt!D164)","v":""},{"$f":"IF(Eingabeblatt!E164=\"\",\"\",Eingabeblatt!E164)","v":""},{"$f":"IF(Eingabeblatt!B164=\"\",\"\",Eingabeblatt!B164)","v":""},{"$f":"Eingabeblatt!R164","v":{"$error":"#DIV/0!"}},{"$f":"Eingabeblatt!Q164","v":{"$error":"#DIV/0!"}}]
[{"$f":"IF(Eingabeblatt!C165=\"\",\"\",Eingabeblatt!C165)","v":""},{"$f":"IF(Eingabeblatt!D165=\"\",\"\",Eingabeblatt!D165)","v":""},{"$f":"IF(Eingabeblatt!E165=\"\",\"\",Eingabeblatt!E165)","v":""},{"$f":"IF(Eingabeblatt!B165=\"\",\"\",Eingabeblatt!B165)","v":""},{"$f":"Eingabeblatt!R165","v":{"$error":"#DIV/0!"}},{"$f":"Eingabeblatt!Q165","v":{"$error":"#DIV/0!"}}]
[{"$f":"IF(Eingabeblatt!C166=\"\",\"\",Eingabeblatt!C166)","v":""},{"$f":"IF(Eingabeblatt!D166=\"\",\"\",Eingabeblatt!D166)","v":""},{"$f":"IF(Eingabeblatt!E166=\"\",\"\",Eingabeblatt!E166)","v":""},{"$f":"IF(Eingabeblatt!B166=\"\",\"\",Eingabeblatt!B166)","v":""},{"$f":"Eingabeblatt!R166","v":{"$error":"#DIV/0!"}},{"$f":"Eingabeblatt!Q166","v":{"$error":"#DIV/0!"}}]
[{"$f":"IF(Eingabeblatt!C167=\"\",\"\",Eingabeblatt!C167)","v":""},{"$f":"IF(Eingabeblatt!D167=\"\",\"\",Eingabeblatt!D167)","v":""},{"$f":"IF(Eingabeblatt!E167=\"\",\"\",Eingabeblatt!E167)","v":""},{"$f":"IF(Eingabeblatt!B167=\"\",\"\",Eingabeblatt!B167)","v":""},{"$f":"Eingabeblatt!R167","v":{"$error":"#DIV/0!"}},{"$f":"Eingabeblatt!Q167","v":{"$error":"#DIV/0!"}}]
[{"$f":"IF(Eingabeblatt!C168=\"\",\"\",Eingabeblatt!C168)","v":""},{"$f":"IF(Eingabeblatt!D168=\"\",\"\",Eingabeblatt!D168)","v":""},{"$f":"IF(Eingabeblatt!E168=\"\",\"\",Eingabeblatt!E168)","v":""},{"$f":"IF(Eingabeblatt!B168=\"\",\"\",Eingabeblatt!B168)","v":""},{"$f":"Eingabeblatt!R168","v":{"$error":"#DIV/0!"}},{"$f":"Eingabeblatt!Q168","v":{"$error":"#DIV/0!"}}]
[{"$f":"IF(Eingabeblatt!C169=\"\",\"\",Eingabeblatt!C169)","v":""},{"$f":"IF(Eingabeblatt!D169=\"\",\"\",Eingabeblatt!D169)","v":""},{"$f":"IF(Eingabeblatt!E169=\"\",\"\",Eingabeblatt!E169)","v":""},{"$f":"IF(Eingabeblatt!B169=\"\",\"\",Eingabeblatt!B169)","v":""},{"$f":"Eingabeblatt!R169","v":{"$error":"#DIV/0!"}},{"$f":"Eingabeblatt!Q169","v":{"$error":"#DIV/0!"}}]
[{"$f":"IF(Eingabeblatt!C170=\"\",\"\",Eingabeblatt!C170)","v":""},{"$f":"IF(Eingabeblatt!D170=\"\",\"\",Eingabeblatt!D170)","v":""},{"$f":"IF(Eingabeblatt!E170=\"\",\"\",Eingabeblatt!E170)","v":""},{"$f":"IF(Eingabeblatt!B170=\"\",\"\",Eingabeblatt!B170)","v":""},{"$f":"Eingabeblatt!R170","v":{"$error":"#DIV/0!"}},{"$f":"Eingabeblatt!Q170","v":{"$error":"#DIV/0!"}}]
[{"$f":"IF(Eingabeblatt!C171=\"\",\"\",Eingabeblatt!C171)","v":""},{"$f":"IF(Eingabeblatt!D171=\"\",\"\",Eingabeblatt!D171)","v":""},{"$f":"IF(Eingabeblatt!E171=\"\",\"\",Eingabeblatt!E171)","v":""},{"$f":"IF(Eingabeblatt!B171=\"\",\"\",Eingabeblatt!B171)","v":""},{"$f":"Eingabeblatt!R171","v":{"$error":"#DIV/0!"}},{"$f":"Eingabeblatt!Q171","v":{"$error":"#DIV/0!"}}]
[{"$f":"IF(Eingabeblatt!C172=\"\",\"\",Eingabeblatt!C172)","v":""},{"$f":"IF(Eingabeblatt!D172=\"\",\"\",Eingabeblatt!D172)","v":""},{"$f":"IF(Eingabeblatt!E172=\"\",\"\",Eingabeblatt!E172)","v":""},{"$f":"IF(Eingabeblatt!B172=\"\",\"\",Eingabeblatt!B172)","v":""},{"$f":"Eingabeblatt!R172","v":{"$error":"#DIV/0!"}},{"$f":"Eingabeblatt!Q172","v":{"$error":"#DIV/0!"}}]
[{"$f":"IF(Eingabeblatt!C173=\"\",\"\",Eingabeblatt!C173)","v":""},{"$f":"IF(Eingabeblatt!D173=\"\",\"\",Eingabeblatt!D173)","v":""},{"$f":"IF(Eingabeblatt!E173=\"\",\"\",Eingabeblatt!E173)","v":""},{"$f":"IF(Eingabeblatt!B173=\"\",\"\",Eingabeblatt!B173)","v":""},{"$f":"Eingabeblatt!R173","v":{"$error":"#DIV/0!"}},{"$f":"Eingabeblatt!Q173","v":{"$error":"#DIV/0!"}}]
[{"$f":"IF(Eingabeblatt!C174=\"\",\"\",Eingabeblatt!C174)","v":""},{"$f":"IF(Eingabeblatt!D174=\"\",\"\",Eingabeblatt!D174)","v":""},{"$f":"IF(Eingabeblatt!E174=\"\",\"\",Eingabeblatt!E174)","v":""},{"$f":"IF(Eingabeblatt!B174=\"\",\"\",Eingabeblatt!B174)","v":""},{"$f":"Eingabeblatt!R174","v":{"$error":"#DIV/0!"}},{"$f":"Eingabeblatt!Q174","v":{"$error":"#DIV/0!"}}]
[{"$f":"IF(Eingabeblatt!C175=\"\",\"\",Eingabeblatt!C175)","v":""},{"$f":"IF(Eingabeblatt!D175=\"\",\"\",Eingabeblatt!D175)","v":""},{"$f":"IF(Eingabeblatt!E175=\"\",\"\",Eingabeblatt!E175)","v":""},{"$f":"IF(Eingabeblatt!B175=\"\",\"\",Eingabeblatt!B175)","v":""},{"$f":"Eingabeblatt!R175","v":{"$error":"#DIV/0!"}},{"$f":"Eingabeblatt!Q175","v":{"$error":"#DIV/0!"}}]
[{"$f":"IF(Eingabeblatt!C176=\"\",\"\",Eingabeblatt!C176)","v":""},{"$f":"IF(Eingabeblatt!D176=\"\",\"\",Eingabeblatt!D176)","v":""},{"$f":"IF(Eingabeblatt!E176=\"\",\"\",Eingabeblatt!E176)","v":""},{"$f":"IF(Eingabeblatt!B176=\"\",\"\",Eingabeblatt!B176)","v":""},{"$f":"Eingabeblatt!R176","v":{"$error":"#DIV/0!"}},{"$f":"Eingabeblatt!Q176","v":{"$error":"#DIV/0!"}}]
[{"$f":"IF(Eingabeblatt!C177=\"\",\"\",Eingabeblatt!C177)","v":""},{"$f":"IF(Eingabeblatt!D177=\"\",\"\",Eingabeblatt!D177)","v":""},{"$f":"IF(Eingabeblatt!E177=\"\",\"\",Eingabeblatt!E177)","v":""},{"$f":"IF(Eingabeblatt!B177=\"\",\"\",Eingabeblatt!B177)","v":""},{"$f":"Eingabeblatt!R177","v":{"$error":"#DIV/0!"}},{"$f":"Eingabeblatt!Q177","v":{"$error":"#DIV/0!"}}]
[{"$f":"IF(Eingabeblatt!C178=\"\",\"\",Eingabeblatt!C178)","v":""},{"$f":"IF(Eingabeblatt!D178=\"\",\"\",Eingabeblatt!D178)","v":""},{"$f":"IF(Eingabeblatt!E178=\"\",\"\",Eingabeblatt!E178)","v":""},{"$f":"IF(Eingabeblatt!B178=\"\",\"\",Eingabeblatt!B178)","v":""},{"$f":"Eingabeblatt!R178","v":{"$error":"#DIV/0!"}},{"$f":"Eingabeblatt!Q178","v":{"$error":"#DIV/0!"}}]
[{"$f":"IF(Eingabeblatt!C179=\"\",\"\",Eingabeblatt!C179)","v":""},{"$f":"IF(Eingabeblatt!D179=\"\",\"\",Eingabeblatt!D179)","v":""},{"$f":"IF(Eingabeblatt!E179=\"\",\"\",Eingabeblatt!E179)","v":""},{"$f":"IF(Eingabeblatt!B179=\"\",\"\",Eingabeblatt!B179)","v":""},{"$f":"Eingabeblatt!R179","v":{"$error":"#DIV/0!"}},{"$f":"Eingabeblatt!Q179","v":{"$error":"#DIV/0!"}}]
[{"$f":"IF(Eingabeblatt!C180=\"\",\"\",Eingabeblatt!C180)","v":""},{"$f":"IF(Eingabeblatt!D180=\"\",\"\",Eingabeblatt!D180)","v":""},{"$f":"IF(Eingabeblatt!E180=\"\",\"\",Eingabeblatt!E180)","v":""},{"$f":"IF(Eingabeblatt!B180=\"\",\"\",Eingabeblatt!B180)","v":""},{"$f":"Eingabeblatt!R180","v":{"$error":"#DIV/0!"}},{"$f":"Eingabeblatt!Q180","v":{"$error":"#DIV/0!"}}]
[{"$f":"IF(Eingabeblatt!C181=\"\",\"\",Eingabeblatt!C181)","v":""},{"$f":"IF(Eingabeblatt!D181=\"\",\"\",Eingabeblatt!D181)","v":""},{"$f":"IF(Eingabeblatt!E181=\"\",\"\",Eingabeblatt!E181)","v":""},{"$f":"IF(Eingabeblatt!B181=\"\",\"\",Eingabeblatt!B181)","v":""},{"$f":"Eingabeblatt!R181","v":{"$error":"#DIV/0!"}},{"$f":"Eingabeblatt!Q181","v":{"$error":"#DIV/0!"}}]
[{"$f":"IF(Eingabeblatt!C182=\"\",\"\",Eingabeblatt!C182)","v":""},{"$f":"IF(Eingabeblatt!D182=\"\",\"\",Eingabeblatt!D182)","v":""},{"$f":"IF(Eingabeblatt!E182=\"\",\"\",Eingabeblatt!E182)","v":""},{"$f":"IF(Eingabeblatt!B182=\"\",\"\",Eingabeblatt!B182)","v":""},{"$f":"Eingabeblatt!R182","v":{"$error":"#DIV/0!"}},{"$f":"Eingabeblatt!Q182","v":{"$error":"#DIV/0!"}}]
[{"$f":"IF(Eingabeblatt!C183=\"\",\"\",Eingabeblatt!C183)","v":""},{"$f":"IF(Eingabeblatt!D183=\"\",\"\",Eingabeblatt!D183)","v":""},{"$f":"IF(Eingabeblatt!E183=\"\",\"\",Eingabeblatt!E183)","v":""},{"$f":"IF(Eingabeblatt!B183=\"\",\"\",Eingabeblatt!B183)","v":""},{"$f":"Eingabeblatt!R183","v":{"$error":"#DIV/0!"}},{"$f":"Eingabeblatt!Q183","v":{"$error":"#DIV/0!"}}]
[{"$f":"IF(Eingabeblatt!C184=\"\",\"\",Eingabeblatt!C184)","v":""},{"$f":"IF(Eingabeblatt!D184=\"\",\"\",Eingabeblatt!D184)","v":""},{"$f":"IF(Eingabeblatt!E184=\"\",\"\",Eingabeblatt!E184)","v":""},{"$f":"IF(Eingabeblatt!B184=\"\",\"\",Eingabeblatt!B184)","v":""},{"$f":"Eingabeblatt!R184","v":{"$error":"#DIV/0!"}},{"$f":"Eingabeblatt!Q184","v":{"$error":"#DIV/0!"}}]
[{"$f":"IF(Eingabeblatt!C185=\"\",\"\",Eingabeblatt!C185)","v":""},{"$f":"IF(Eingabeblatt!D185=\"\",\"\",Eingabeblatt!D185)","v":""},{"$f":"IF(Eingabeblatt!E185=\"\",\"\",Eingabeblatt!E185)","v":""},{"$f":"IF(Eingabeblatt!B185=\"\",\"\",Eingabeblatt!B185)","v":""},{"$f":"Eingabeblatt!R185","v":{"$error":"#DIV/0!"}},{"$f":"Eingabeblatt!Q185","v":{"$error":"#DIV/0!"}}]
[{"$f":"IF(Eingabeblatt!C186=\"\",\"\",Eingabeblatt!C186)","v":""},{"$f":"IF(Eingabeblatt!D186=\"\",\"\",Eingabeblatt!D186)","v":""},{"$f":"IF(Eingabeblatt!E186=\"\",\"\",Eingabeblatt!E186)","v":""},{"$f":"IF(Eingabeblatt!B186=\"\",\"\",Eingabeblatt!B186)","v":""},{"$f":"Eingabeblatt!R186","v":{"$error":"#DIV/0!"}},{"$f":"Eingabeblatt!Q186","v":{"$error":"#DIV/0!"}}]
[{"$f":"IF(Eingabeblatt!C187=\"\",\"\",Eingabeblatt!C187)","v":""},{"$f":"IF(Eingabeblatt!D187=\"\",\"\",Eingabeblatt!D187)","v":""},{"$f":"IF(Eingabeblatt!E187=\"\",\"\",Eingabeblatt!E187)","v":""},{"$f":"IF(Eingabeblatt!B187=\"\",\"\",Eingabeblatt!B187)","v":""},{"$f":"Eingabeblatt!R187","v":{"$error":"#DIV/0!"}},{"$f":"Eingabeblatt!Q187","v":{"$error":"#DIV/0!"}}]
[{"$f":"IF(Eingabeblatt!C188=\"\",\"\",Eingabeblatt!C188)","v":""},{"$f":"IF(Eingabeblatt!D188=\"\",\"\",Eingabeblatt!D188)","v":""},{"$f":"IF(Eingabeblatt!E188=\"\",\"\",Eingabeblatt!E188)","v":""},{"$f":"IF(Eingabeblatt!B188=\"\",\"\",Eingabeblatt!B188)","v":""},{"$f":"Eingabeblatt!R188","v":{"$error":"#DIV/0!"}},{"$f":"Eingabeblatt!Q188","v":{"$error":"#DIV/0!"}}]
[{"$f":"IF(Eingabeblatt!C189=\"\",\"\",Eingabeblatt!C189)","v":""},{"$f":"IF(Eingabeblatt!D189=\"\",\"\",Eingabeblatt!D189)","v":""},{"$f":"IF(Eingabeblatt!E189=\"\",\"\",Eingabeblatt!E189)","v":""},{"$f":"IF(Eingabeblatt!B189=\"\",\"\",Eingabeblatt!B189)","v":""},{"$f":"Eingabeblatt!R189","v":{"$error":"#DIV/0!"}},{"$f":"Eingabeblatt!Q189","v":{"$error":"#DIV/0!"}}]
[{"$f":"IF(Eingabeblatt!C190=\"\",\"\",Eingabeblatt!C190)","v":""},{"$f":"IF(Eingabeblatt!D190=\"\",\"\",Eingabeblatt!D190)","v":""},{"$f":"IF(Eingabeblatt!E190=\"\",\"\",Eingabeblatt!E190)","v":""},{"$f":"IF(Eingabeblatt!B190=\"\",\"\",Eingabeblatt!B190)","v":""},{"$f":"Eingabeblatt!R190","v":{"$error":"#DIV/0!"}},{"$f":"Eingabeblatt!Q190","v":{"$error":"#DIV/0!"}}]
[{"$f":"IF(Eingabeblatt!C191=\"\",\"\",Eingabeblatt!C191)","v":""},{"$f":"IF(Eingabeblatt!D191=\"\",\"\",Eingabeblatt!D191)","v":""},{"$f":"IF(Eingabeblatt!E191=\"\",\"\",Eingabeblatt!E191)","v":""},{"$f":"IF(Eingabeblatt!B191=\"\",\"\",Eingabeblatt!B191)","v":""},{"$f":"Eingabeblatt!R191","v":{"$error":"#DIV/0!"}},{"$f":"Eingabeblatt!Q191","v":{"$error":"#DIV/0!"}}]
[{"$f":"IF(Eingabeblatt!C192=\"\",\"\",Eingabeblatt!C192)","v":""},{"$f":"IF(Eingabeblatt!D192=\"\",\"\",Eingabeblatt!D192)","v":""},{"$f":"IF(Eingabeblatt!E192=\"\",\"\",Eingabeblatt!E192)","v":""},{"$f":"IF(Eingabeblatt!B192=\"\",\"\",Eingabeblatt!B192)","v":""},{"$f":"Eingabeblatt!R192","v":{"$error":"#DIV/0!"}},{"$f":"Eingabeblatt!Q192","v":{"$error":"#DIV/0!"}}]
[{"$f":"IF(Eingabeblatt!C193=\"\",\"\",Eingabeblatt!C193)","v":""},{"$f":"IF(Eingabeblatt!D193=\"\",\"\",Eingabeblatt!D193)","v":""},{"$f":"IF(Eingabeblatt!E193=\"\",\"\",Eingabeblatt!E193)","v":""},{"$f":"IF(Eingabeblatt!B193=\"\",\"\",Eingabeblatt!B193)","v":""},{"$f":"Eingabeblatt!R193","v":{"$error":"#DIV/0!"}},{"$f":"Eingabeblatt!Q193","v":{"$error":"#DIV/0!"}}]
[{"$f":"IF(Eingabeblatt!C194=\"\",\"\",Eingabeblatt!C194)","v":""},{"$f":"IF(Eingabeblatt!D194=\"\",\"\",Eingabeblatt!D194)","v":""},{"$f":"IF(Eingabeblatt!E194=\"\",\"\",Eingabeblatt!E194)","v":""},{"$f":"IF(Eingabeblatt!B194=\"\",\"\",Eingabeblatt!B194)","v":""},{"$f":"Eingabeblatt!R194","v":{"$error":"#DIV/0!"}},{"$f":"Eingabeblatt!Q194","v":{"$error":"#DIV/0!"}}]
[{"$f":"IF(Eingabeblatt!C195=\"\",\"\",Eingabeblatt!C195)","v":""},{"$f":"IF(Eingabeblatt!D195=\"\",\"\",Eingabeblatt!D195)","v":""},{"$f":"IF(Eingabeblatt!E195=\"\",\"\",Eingabeblatt!E195)","v":""},{"$f":"IF(Eingabeblatt!B195=\"\",\"\",Eingabeblatt!B195)","v":""},{"$f":"Eingabeblatt!R195","v":{"$error":"#DIV/0!"}},{"$f":"Eingabeblatt!Q195","v":{"$error":"#DIV/0!"}}]
[{"$f":"IF(Eingabeblatt!C196=\"\",\"\",Eingabeblatt!C196)","v":""},{"$f":"IF(Eingabeblatt!D196=\"\",\"\",Eingabeblatt!D196)","v":""},{"$f":"IF(Eingabeblatt!E196=\"\",\"\",Eingabeblatt!E196)","v":""},{"$f":"IF(Eingabeblatt!B196=\"\",\"\",Eingabeblatt!B196)","v":""},{"$f":"Eingabeblatt!R196","v":{"$error":"#DIV/0!"}},{"$f":"Eingabeblatt!Q196","v":{"$error":"#DIV/0!"}}]
[{"$f":"IF(Eingabeblatt!C197=\"\",\"\",Eingabeblatt!C197)","v":""},{"$f":"IF(Eingabeblatt!D197=\"\",\"\",Eingabeblatt!D197)","v":""},{"$f":"IF(Eingabeblatt!E197=\"\",\"\",Eingabeblatt!E197)","v":""},{"$f":"IF(Eingabeblatt!B197=\"\",\"\",Eingabeblatt!B197)","v":""},{"$f":"Eingabeblatt!R197","v":{"$error":"#DIV/0!"}},{"$f":"Eingabeblatt!Q197","v":{"$error":"#DIV/0!"}}]
[{"$f":"IF(Eingabeblatt!C198=\"\",\"\",Eingabeblatt!C198)","v":""},{"$f":"IF(Eingabeblatt!D198=\"\",\"\",Eingabeblatt!D198)","v":""},{"$f":"IF(Eingabeblatt!E198=\"\",\"\",Eingabeblatt!E198)","v":""},{"$f":"IF(Eingabeblatt!B198=\"\",\"\",Eingabeblatt!B198)","v":""},{"$f":"Eingabeblatt!R198","v":{"$error":"#DIV/0!"}},{"$f":"Eingabeblatt!Q198","v":{"$error":"#DIV/0!"}}]
[{"$f":"IF(Eingabeblatt!C199=\"\",\"\",Eingabeblatt!C199)","v":""},{"$f":"IF(Eingabeblatt!D199=\"\",\"\",Eingabeblatt!D199)","v":""},{"$f":"IF(Eingabeblatt!E199=\"\",\"\",Eingabeblatt!E199)","v":""},{"$f":"IF(Eingabeblatt!B199=\"\",\"\",Eingabeblatt!B199)","v":""},{"$f":"Eingabeblatt!R199","v":{"$error":"#DIV/0!"}},{"$f":"Eingabeblatt!Q199","v":{"$error":"#DIV/0!"}}]
[{"$f":"IF(Eingabeblatt!C200=\"\",\"\",Eingabeblatt!C200)","v":""},{"$f":"IF(Eingabeblatt!D200=\"\",\"\",Eingabeblatt!D200)","v":""},{"$f":"IF(Eingabeblatt!E200=\"\",\"\",Eingabeblatt!E200)","v":""},{"$f":"IF(Eingabeblatt!B200=\"\",\"\",Eingabeblatt!B200)","v":""},{"$f":"Eingabeblatt!R200","v":{"$error":"#DIV/0!"}},{"$f":"Eingabeblatt!Q200","v":{"$error":"#DIV/0!"}}]
[{"$f":"IF(Eingabeblatt!C201=\"\",\"\",Eingabeblatt!C201)","v":""},{"$f":"IF(Eingabeblatt!D201=\"\",\"\",Eingabeblatt!D201)","v":""},{"$f":"IF(Eingabeblatt!E201=\"\",\"\",Eingabeblatt!E201)","v":""},{"$f":"IF(Eingabeblatt!B201=\"\",\"\",Eingabeblatt!B201)","v":""},{"$f":"Eingabeblatt!R201","v":{"$error":"#DIV/0!"}},{"$f":"Eingabeblatt!Q201","v":{"$error":"#DIV/0!"}}]
[{"$f":"IF(Eingabeblatt!C202=\"\",\"\",Eingabeblatt!C202)","v":""},{"$f":"IF(Eingabeblatt!D202=\"\",\"\",Eingabeblatt!D202)","v":""},{"$f":"IF(Eingabeblatt!E202=\"\",\"\",Eingabeblatt!E202)","v":""},{"$f":"IF(Eingabeblatt!B202=\"\",\"\",Eingabeblatt!B202)","v":""},{"$f":"Eingabeblatt!R202","v":{"$error":"#DIV/0!"}},{"$f":"Eingabeblatt!Q202","v":{"$error":"#DIV/0!"}}]
[{"$f":"IF(Eingabeblatt!C203=\"\",\"\",Eingabeblatt!C203)","v":""},{"$f":"IF(Eingabeblatt!D203=\"\",\"\",Eingabeblatt!D203)","v":""},{"$f":"IF(Eingabeblatt!E203=\"\",\"\",Eingabeblatt!E203)","v":""},{"$f":"IF(Eingabeblatt!B203=\"\",\"\",Eingabeblatt!B203)","v":""},{"$f":"Eingabeblatt!R203","v":{"$error":"#DIV/0!"}},{"$f":"Eingabeblatt!Q203","v":{"$error":"#DIV/0!"}}]
[null,null,null,null,{"$f":"Eingabeblatt!R204","v":{"$error":"#DIV/0!"}},{"$f":"Eingabeblatt!Q204","v":{"$error":"#DIV/0!"}}]
[null,null,null,null,{"$f":"Eingabeblatt!R205","v":{"$error":"#DIV/0!"}},{"$f":"Eingabeblatt!Q205","v":{"$error":"#DIV/0!"}}]
[null,null,null,null,{"$f":"Eingabeblatt!R206","v":{"$error":"#DIV/0!"}},{"$f":"Eingabeblatt!Q206","v":{"$error":"#DIV/0!"}}]
[null,null,null,null,{"$f":"Eingabeblatt!R207","v":{"$error":"#DIV/0!"}},{"$f":"Eingabeblatt!Q207","v":{"$error":"#DIV/0!"}}]
[null,null,null,null,{"$f":"Eingabeblatt!R208","v":{"$error":"#DIV/0!"}},{"$f":"Eingabeblatt!Q208","v":{"$error":"#DIV/0!"}}]
[null,null,null,null,{"$f":"Eingabeblatt!R209","v":{"$error":"#DIV/0!"}},{"$f":"Eingabeblatt!Q209","v":{"$error":"#DIV/0!"}}]
[null,null,null,null,{"$f":"Eingabeblatt!R210","v":{"$error":"#DIV/0!"}},{"$f":"Eingabeblatt!Q210","v":{"$error":"#DIV/0!"}}]
[null,null,null,null,{"$f":"Eingabeblatt!R211","v":{"$error":"#DIV/0!"}},{"$f":"Eingabeblatt!Q211","v":{"$error":"#DIV/0!"}}]
[null,null,null,null,{"$f":"Eingabeblatt!R212","v":{"$error":"#DIV/0!"}},{"$f":"Eingabeblatt!Q212","v":{"$error":"#DIV/0!"}}]
[null,null,null,null,{"$f":"Eingabeblatt!R213","v":{"$error":"#DIV/0!"}},{"$f":"Eingabeblatt!Q213","v":{"$error":"#DIV/0!"}}]
[null,null,null,null,{"$f":"Eingabeblatt!R214","v":{"$error":"#DIV/0!"}},{"$f":"Eingabeblatt!Q214","v":{"$error":"#DIV/0!"}}]
[null,null,null,null,{"$f":"Eingabeblatt!R215","v":{"$error":"#DIV/0!"}},{"$f":"Eingabeblatt!Q215","v":{"$error":"#DIV/0!"}}]
[null,null,null,null,{"$f":"Eingabeblatt!R216","v":{"$error":"#DIV/0!"}},{"$f":"Eingabeblatt!Q216","v":{"$error":"#DIV/0!"}}]
[null,null,null,null,{"$f":"Eingabeblatt!R217","v":{"$error":"#DIV/0!"}},{"$f":"Eingabeblatt!Q217","v":{"$error":"#DIV/0!"}}]
[null,null,null,null,{"$f":"Eingabeblatt!R218","v":{"$error":"#DIV/0!"}},{"$f":"Eingabeblatt!Q218","v":{"$error":"#DIV/0!"}}]
[null,null,null,null,{"$f":"Eingabeblatt!R219","v":{"$error":"#DIV/0!"}},{"$f":"Eingabeblatt!Q219","v":{"$error":"#DIV/0!"}}]
[null,null,null,null,{"$f":"Eingabeblatt!R220","v":{"$error":"#DIV/0!"}},{"$f":"Eingabeblatt!Q220","v":{"$error":"#DIV/0!"}}]
[null,null,null,null,{"$f":"Eingabeblatt!R221","v":{"$error":"#DIV/0!"}},{"$f":"Eingabeblatt!Q221","v":{"$error":"#DIV/0!"}}]
[null,null,null,null,{"$f":"Eingabeblatt!R222","v":{"$error":"#DIV/0!"}},{"$f":"Eingabeblatt!Q222","v":{"$error":"#DIV/0!"}}]
[null,null,null,null,{"$f":"Eingabeblatt!R223","v":{"$error":"#DIV/0!"}},{"$f":"Eingabeblatt!Q223","v":{"$error":"#DIV/0!"}}]
[null,null,null,null,{"$f":"Eingabeblatt!R224","v":{"$error":"#DIV/0!"}},{"$f":"Eingabeblatt!Q224","v":{"$error":"#DIV/0!"}}]
[null,null,null,null,{"$f":"Eingabeblatt!R225","v":{"$error":"#DIV/0!"}},{"$f":"Eingabeblatt!Q225","v":{"$error":"#DIV/0!"}}]
[null,null,null,null,{"$f":"Eingabeblatt!R226","v":{"$error":"#DIV/0!"}},{"$f":"Eingabeblatt!Q226","v":{"$error":"#DIV/0!"}}]
[null,null,null,null,{"$f":"Eingabeblatt!R227","v":{"$error":"#DIV/0!"}},{"$f":"Eingabeblatt!Q227","v":{"$error":"#DIV/0!"}}]
[null,null,null,null,{"$f":"Eingabeblatt!R228","v":{"$error":"#DIV/0!"}},{"$f":"Eingabeblatt!Q228","v":{"$error":"#DIV/0!"}}]
[null,null,null,null,{"$f":"Eingabeblatt!R229","v":{"$error":"#DIV/0!"}},{"$f":"Eingabeblatt!Q229","v":{"$error":"#DIV/0!"}}]
[null,null,null,null,{"$f":"Eingabeblatt!R230","v":{"$error":"#DIV/0!"}},{"$f":"Eingabeblatt!Q230","v":{"$error":"#DIV/0!"}}]
[null,null,null,null,{"$f":"Eingabeblatt!R231","v":{"$error":"#DIV/0!"}},{"$f":"Eingabeblatt!Q231","v":{"$error":"#DIV/0!"}}]
[null,null,null,null,{"$f":"Eingabeblatt!R232","v":{"$error":"#DIV/0!"}},{"$f":"Eingabeblatt!Q232","v":{"$error":"#DIV/0!"}}]
[null,null,null,null,{"$f":"Eingabeblatt!R233","v":{"$error":"#DIV/0!"}},{"$f":"Eingabeblatt!Q233","v":{"$error":"#DIV/0!"}}]
[null,null,null,null,{"$f":"Eingabeblatt!R234","v":{"$error":"#DIV/0!"}},{"$f":"Eingabeblatt!Q234","v":{"$error":"#DIV/0!"}}]
[null,null,null,null,{"$f":"Eingabeblatt!R235","v":{"$error":"#DIV/0!"}},{"$f":"Eingabeblatt!Q235","v":{"$error":"#DIV/0!"}}]
[null,null,null,null,{"$f":"Eingabeblatt!R236","v":{"$error":"#DIV/0!"}},{"$f":"Eingabeblatt!Q236","v":{"$error":"#DIV/0!"}}]
[null,null,null,null,{"$f":"Eingabeblatt!R237","v":{"$error":"#DIV/0!"}},{"$f":"Eingabeblatt!Q237","v":{"$error":"#DIV/0!"}}]
[null,null,null,null,{"$f":"Eingabeblatt!R238","v":{"$error":"#DIV/0!"}},{"$f":"Eingabeblatt!Q238","v":{"$error":"#DIV/0!"}}]
[null,null,null,null,{"$f":"Eingabeblatt!R239","v":{"$error":"#DIV/0!"}},{"$f":"Eingabeblatt!Q239","v":{"$error":"#DIV/0!"}}]
[null,null,null,null,{"$f":"Eingabeblatt!R240","v":{"$error":"#DIV/0!"}},{"$f":"Eingabeblatt!Q240","v":{"$error":"#DIV/0!"}}]
[null,null,null,null,{"$f":"Eingabeblatt!R241","v":{"$error":"#DIV/0!"}},{"$f":"Eingabeblatt!Q241","v":{"$error":"#DIV/0!"}}]
[null,null,null,null,{"$f":"Eingabeblatt!R242","v":{"$error":"#DIV/0!"}},{"$f":"Eingabeblatt!Q242","v":{"$error":"#DIV/0!"}}]
[null,null,null,null,{"$f":"Eingabeblatt!R243","v":{"$error":"#DIV/0!"}},{"$f":"Eingabeblatt!Q243","v":{"$error":"#DIV/0!"}}]
[null,null,null,null,{"$f":"Eingabeblatt!R244","v":{"$error":"#DIV/0!"}},{"$f":"Eingabeblatt!Q244","v":{"$error":"#DIV/0!"}}]
[null,null,null,null,{"$f":"Eingabeblatt!R245","v":{"$error":"#DIV/0!"}},{"$f":"Eingabeblatt!Q245","v":{"$error":"#DIV/0!"}}]
[null,null,null,null,{"$f":"Eingabeblatt!R246","v":{"$error":"#DIV/0!"}},{"$f":"Eingabeblatt!Q246","v":{"$error":"#DIV/0!"}}]
[null,null,null,null,{"$f":"Eingabeblatt!R247","v":{"$error":"#DIV/0!"}},{"$f":"Eingabeblatt!Q247","v":{"$error":"#DIV/0!"}}]
[null,null,null,null,{"$f":"Eingabeblatt!R248","v":{"$error":"#DIV/0!"}},{"$f":"Eingabeblatt!Q248","v":{"$error":"#DIV/0!"}}]
[null,null,null,null,{"$f":"Eingabeblatt!R249","v":{"$error":"#DIV/0!"}},{"$f":"Eingabeblatt!Q249","v":{"$error":"#DIV/0!"}}]
[null,null,null,null,{"$f":"Eingabeblatt!R250","v":{"$error":"#DIV/0!"}},{"$f":"Eingabeblatt!Q250","v":{"$error":"#DIV/0!"}}]
[null,null,null,null,{"$f":"Eingabeblatt!R251","v":{"$error":"#DIV/0!"}},{"$f":"Eingabeblatt!Q251","v":{"$error":"#DIV/0!"}}]
[null,null,null,null,{"$f":"Eingabeblatt!R252","v":{"$error":"#DIV/0!"}},{"$f":"Eingabeblatt!Q252","v":{"$error":"#DIV/0!"}}]
[null,null,null,null,{"$f":"Eingabeblatt!R253","v":{"$error":"#DIV/0!"}},{"$f":"Eingabeblatt!Q253","v":{"$error":"#DIV/0!"}}]
[null,null,null,null,{"$f":"Eingabeblatt!R254","v":{"$error":"#DIV/0!"}},{"$f":"Eingabeblatt!Q254","v":{"$error":"#DIV/0!"}}]
[null,null,null,null,{"$f":"Eingabeblatt!R255","v":{"$error":"#DIV/0!"}},{"$f":"Eingabeblatt!Q255","v":{"$error":"#DIV/0!"}}]
[null,null,null,null,{"$f":"Eingabeblatt!R256","v":{"$error":"#DIV/0!"}},{"$f":"Eingabeblatt!Q256","v":{"$error":"#DIV/0!"}}]
[null,null,null,null,{"$f":"Eingabeblatt!R257","v":{"$error":"#DIV/0!"}},{"$f":"Eingabeblatt!Q257","v":{"$error":"#DIV/0!"}}]
[null,null,null,null,{"$f":"Eingabeblatt!R258","v":{"$error":"#DIV/0!"}},{"$f":"Eingabeblatt!Q258","v":{"$error":"#DIV/0!"}}]
[null,null,null,null,{"$f":"Eingabeblatt!R259","v":{"$error":"#DIV/0!"}},{"$f":"Eingabeblatt!Q259","v":{"$error":"#DIV/0!"}}]
[null,null,null,null,{"$f":"Eingabeblatt!R260","v":{"$error":"#DIV/0!"}},{"$f":"Eingabeblatt!Q260","v":{"$error":"#DIV/0!"}}]
[null,null,null,null,{"$f":"Eingabeblatt!R261","v":{"$error":"#DIV/0!"}},{"$f":"Eingabeblatt!Q261","v":{"$error":"#DIV/0!"}}]
[null,null,null,null,{"$f":"Eingabeblatt!R262","v":{"$error":"#DIV/0!"}},{"$f":"Eingabeblatt!Q262","v":{"$error":"#DIV/0!"}}]
[null,null,null,null,{"$f":"Eingabeblatt!R263","v":{"$error":"#DIV/0!"}},{"$f":"Eingabeblatt!Q263","v":{"$error":"#DIV/0!"}}]
[null,null,null,null,{"$f":"Eingabeblatt!R264","v":{"$error":"#DIV/0!"}},{"$f":"Eingabeblatt!Q264","v":{"$error":"#DIV/0!"}}]
[null,null,null,null,{"$f":"Eingabeblatt!R265","v":{"$error":"#DIV/0!"}},{"$f":"Eingabeblatt!Q265","v":{"$error":"#DIV/0!"}}]
[null,null,null,null,{"$f":"Eingabeblatt!R266","v":{"$error":"#DIV/0!"}},{"$f":"Eingabeblatt!Q266","v":{"$error":"#DIV/0!"}}]
[null,null,null,null,{"$f":"Eingabeblatt!R267","v":{"$error":"#DIV/0!"}},{"$f":"Eingabeblatt!Q267","v":{"$error":"#DIV/0!"}}]
[null,null,null,null,{"$f":"Eingabeblatt!R268","v":{"$error":"#DIV/0!"}},{"$f":"Eingabeblatt!Q268","v":{"$error":"#DIV/0!"}}]
[null,null,null,null,{"$f":"Eingabeblatt!R269","v":{"$error":"#DIV/0!"}},{"$f":"Eingabeblatt!Q269","v":{"$error":"#DIV/0!"}}]
[null,null,null,null,{"$f":"Eingabeblatt!R270","v":{"$error":"#DIV/0!"}},{"$f":"Eingabeblatt!Q270","v":{"$error":"#DIV/0!"}}]
[null,null,null,null,{"$f":"Eingabeblatt!R271","v":{"$error":"#DIV/0!"}},{"$f":"Eingabeblatt!Q271","v":{"$error":"#DIV/0!"}}]
[null,null,null,null,{"$f":"Eingabeblatt!R272","v":{"$error":"#DIV/0!"}},{"$f":"Eingabeblatt!Q272","v":{"$error":"#DIV/0!"}}]
[null,null,null,null,{"$f":"Eingabeblatt!R273","v":{"$error":"#DIV/0!"}},{"$f":"Eingabeblatt!Q273","v":{"$error":"#DIV/0!"}}]
[null,null,null,null,{"$f":"Eingabeblatt!R274","v":{"$error":"#DIV/0!"}},{"$f":"Eingabeblatt!Q274","v":{"$error":"#DIV/0!"}}]
[null,null,null,null,{"$f":"Eingabeblatt!R275","v":{"$error":"#DIV/0!"}},{"$f":"Eingabeblatt!Q275","v":{"$error":"#DIV/0!"}}]
[null,null,null,null,{"$f":"Eingabeblatt!R276","v":{"$error":"#DIV/0!"}},{"$f":"Eingabeblatt!Q276","v":{"$error":"#DIV/0!"}}]
[null,null,null,null,{"$f":"Eingabeblatt!R277","v":{"$error":"#DIV/0!"}},{"$f":"Eingabeblatt!Q277","v":{"$error":"#DIV/0!"}}]
[null,null,null,null,{"$f":"Eingabeblatt!R278","v":{"$error":"#DIV/0!"}},{"$f":"Eingabeblatt!Q278","v":{"$error":"#DIV/0!"}}]
[null,null,null,null,{"$f":"Eingabeblatt!R279","v":{"$error":"#DIV/0!"}},{"$f":"Eingabeblatt!Q279","v":{"$error":"#DIV/0!"}}]
[null,null,null,null,{"$f":"Eingabeblatt!R280","v":{"$error":"#DIV/0!"}},{"$f":"Eingabeblatt!Q280","v":{"$error":"#DIV/0!"}}]
[null,null,null,null,{"$f":"Eingabeblatt!R281","v":{"$error":"#DIV/0!"}},{"$f":"Eingabeblatt!Q281","v":{"$error":"#DIV/0!"}}]
[null,null,null,null,{"$f":"Eingabeblatt!R282","v":{"$error":"#DIV/0!"}},{"$f":"Eingabeblatt!Q282","v":{"$error":"#DIV/0!"}}]
[null,null,null,null,{"$f":"Eingabeblatt!R283","v":{"$error":"#DIV/0!"}},{"$f":"Eingabeblatt!Q283","v":{"$error":"#DIV/0!"}}]
[null,null,null,null,{"$f":"Eingabeblatt!R284","v":{"$error":"#DIV/0!"}},{"$f":"Eingabeblatt!Q284","v":{"$error":"#DIV/0!"}}]
[null,null,null,null,{"$f":"Eingabeblatt!R285","v":{"$error":"#DIV/0!"}},{"$f":"Eingabeblatt!Q285","v":{"$error":"#DIV/0!"}}]
[null,null,null,null,{"$f":"Eingabeblatt!R286","v":{"$error":"#DIV/0!"}},{"$f":"Eingabeblatt!Q286","v":{"$error":"#DIV/0!"}}]
[null,null,null,null,{"$f":"Eingabeblatt!R287","v":{"$error":"#DIV/0!"}},{"$f":"Eingabeblatt!Q287","v":{"$error":"#DIV/0!"}}]
[null,null,null,null,{"$f":"Eingabeblatt!R288","v":{"$error":"#DIV/0!"}},{"$f":"Eingabeblatt!Q288","v":{"$error":"#DIV/0!"}}]
[null,null,null,null,{"$f":"Eingabeblatt!R289","v":{"$error":"#DIV/0!"}},{"$f":"Eingabeblatt!Q289","v":{"$error":"#DIV/0!"}}]
[null,null,null,null,{"$f":"Eingabeblatt!R290","v":{"$error":"#DIV/0!"}},{"$f":"Eingabeblatt!Q290","v":{"$error":"#DIV/0!"}}]
[null,null,null,null,{"$f":"Eingabeblatt!R291","v":{"$error":"#DIV/0!"}},{"$f":"Eingabeblatt!Q291","v":{"$error":"#DIV/0!"}}]
[null,null,null,null,{"$f":"Eingabeblatt!R292","v":{"$error":"#DIV/0!"}},{"$f":"Eingabeblatt!Q292","v":{"$error":"#DIV/0!"}}]
[null,null,null,null,{"$f":"Eingabeblatt!R293","v":{"$error":"#DIV/0!"}},{"$f":"Eingabeblatt!Q293","v":{"$error":"#DIV/0!"}}]
[null,null,null,null,{"$f":"Eingabeblatt!R294","v":{"$error":"#DIV/0!"}},{"$f":"Eingabeblatt!Q294","v":{"$error":"#DIV/0!"}}]
[null,null,null,null,{"$f":"Eingabeblatt!R295","v":{"$error":"#DIV/0!"}},{"$f":"Eingabeblatt!Q295","v":{"$error":"#DIV/0!"}}]
[null,null,null,null,{"$f":"Eingabeblatt!R296","v":{"$error":"#DIV/0!"}},{"$f":"Eingabeblatt!Q296","v":{"$error":"#DIV/0!"}}]
[null,null,null,null,{"$f":"Eingabeblatt!R297","v":{"$error":"#DIV/0!"}},{"$f":"Eingabeblatt!Q297","v":{"$error":"#DIV/0!"}}]
[null,null,null,null,{"$f":"Eingabeblatt!R298","v":{"$error":"#DIV/0!"}},{"$f":"Eingabeblatt!Q298","v":{"$error":"#DIV/0!"}}]
[null,null,null,null,{"$f":"Eingabeblatt!R299","v":{"$error":"#DIV/0!"}},{"$f":"Eingabeblatt!Q299","v":{"$error":"#DIV/0!"}}]
[null,null,null,null,{"$f":"Eingabeblatt!R300","v":{"$error":"#DIV/0!"}},{"$f":"Eingabeblatt!Q300","v":{"$error":"#DIV/0!"}}]
[null,null,null,null,{"$f":"Eingabeblatt!R301","v":{"$error":"#DIV/0!"}},{"$f":"Eingabeblatt!Q301","v":{"$error":"#DIV/0!"}}]
[null,null,null,null,{"$f":"Eingabeblatt!R302","v":{"$error":"#DIV/0!"}},{"$f":"Eingabeblatt!Q302","v":{"$error":"#DIV/0!"}}]
[null,null,null,null,{"$f":"Eingabeblatt!R303","v":{"$error":"#DIV/0!"}},{"$f":"Eingabeblatt!Q303","v":{"$error":"#DIV/0!"}}]
[null,null,null,null,{"$f":"Eingabeblatt!R304","v":{"$error":"#DIV/0!"}},{"$f":"Eingabeblatt!Q304","v":{"$error":"#DIV/0!"}}]
[null,null,null,null,{"$f":"Eingabeblatt!R305","v":{"$error":"#DIV/0!"}},{"$f":"Eingabeblatt!Q305","v":{"$error":"#DIV/0!"}}]
[null,null,null,null,{"$f":"Eingabeblatt!R306","v":{"$error":"#DIV/0!"}},{"$f":"Eingabeblatt!Q306","v":{"$error":"#DIV/0!"}}]
[null,null,null,null,{"$f":"Eingabeblatt!R307","v":{"$error":"#DIV/0!"}},{"$f":"Eingabeblatt!Q307","v":{"$error":"#DIV/0!"}}]
[null,null,null,null,{"$f":"Eingabeblatt!R308","v":{"$error":"#DIV/0!"}},{"$f":"Eingabeblatt!Q308","v":{"$error":"#DIV/0!"}}]
[null,null,null,null,{"$f":"Eingabeblatt!R309","v":{"$error":"#DIV/0!"}},{"$f":"Eingabeblatt!Q309","v":{"$error":"#DIV/0!"}}]
[null,null,null,null,{"$f":"Eingabeblatt!R310","v":{"$error":"#DIV/0!"}},{"$f":"Eingabeblatt!Q310","v":{"$error":"#DIV/0!"}}]
[null,null,null,null,{"$f":"Eingabeblatt!R311","v":{"$error":"#DIV/0!"}},{"$f":"Eingabeblatt!Q311","v":{"$error":"#DIV/0!"}}]
[null,null,null,null,{"$f":"Eingabeblatt!R312","v":{"$error":"#DIV/0!"}},{"$f":"Eingabeblatt!Q312","v":{"$error":"#DIV/0!"}}]
[null,null,null,null,{"$f":"Eingabeblatt!R313","v":{"$error":"#DIV/0!"}},{"$f":"Eingabeblatt!Q313","v":{"$error":"#DIV/0!"}}]
[null,null,null,null,{"$f":"Eingabeblatt!R314","v":{"$error":"#DIV/0!"}},{"$f":"Eingabeblatt!Q314","v":{"$error":"#DIV/0!"}}]
[null,null,null,null,{"$f":"Eingabeblatt!R315","v":{"$error":"#DIV/0!"}},{"$f":"Eingabeblatt!Q315","v":{"$error":"#DIV/0!"}}]
[null,null,null,null,{"$f":"Eingabeblatt!R316","v":{"$error":"#DIV/0!"}},{"$f":"Eingabeblatt!Q316","v":{"$error":"#DIV/0!"}}]
[null,null,null,null,{"$f":"Eingabeblatt!R317","v":{"$error":"#DIV/0!"}},{"$f":"Eingabeblatt!Q317","v":{"$error":"#DIV/0!"}}]
[null,null,null,null,{"$f":"Eingabeblatt!R318","v":{"$error":"#DIV/0!"}},{"$f":"Eingabeblatt!Q318","v":{"$error":"#DIV/0!"}}]
[null,null,null,null,{"$f":"Eingabeblatt!R319","v":{"$error":"#DIV/0!"}},{"$f":"Eingabeblatt!Q319","v":{"$error":"#DIV/0!"}}]
[null,null,null,null,{"$f":"Eingabeblatt!R320","v":{"$error":"#DIV/0!"}},{"$f":"Eingabeblatt!Q320","v":{"$error":"#DIV/0!"}}]
[null,null,null,null,{"$f":"Eingabeblatt!R321","v":{"$error":"#DIV/0!"}},{"$f":"Eingabeblatt!Q321","v":{"$error":"#DIV/0!"}}]
[null,null,null,null,{"$f":"Eingabeblatt!R322","v":{"$error":"#DIV/0!"}},{"$f":"Eingabeblatt!Q322","v":{"$error":"#DIV/0!"}}]
[null,null,null,null,{"$f":"Eingabeblatt!R323","v":{"$error":"#DIV/0!"}},{"$f":"Eingabeblatt!Q323","v":{"$error":"#DIV/0!"}}]
[null,null,null,null,{"$f":"Eingabeblatt!R324","v":{"$error":"#DIV/0!"}},{"$f":"Eingabeblatt!Q324","v":{"$error":"#DIV/0!"}}]
[null,null,null,null,{"$f":"Eingabeblatt!R325","v":{"$error":"#DIV/0!"}},{"$f":"Eingabeblatt!Q325","v":{"$error":"#DIV/0!"}}]
[null,null,null,null,{"$f":"Eingabeblatt!R326","v":{"$error":"#DIV/0!"}},{"$f":"Eingabeblatt!Q326","v":{"$error":"#DIV/0!"}}]
[null,null,null,null,{"$f":"Eingabeblatt!R327","v":{"$error":"#DIV/0!"}},{"$f":"Eingabeblatt!Q327","v":{"$error":"#DIV/0!"}}]
[null,null,null,null,{"$f":"Eingabeblatt!R328","v":{"$error":"#DIV/0!"}},{"$f":"Eingabeblatt!Q328","v":{"$error":"#DIV/0!"}}]
[null,null,null,null,{"$f":"Eingabeblatt!R329","v":{"$error":"#DIV/0!"}},{"$f":"Eingabeblatt!Q329","v":{"$error":"#DIV/0!"}}]
[null,null,null,null,{"$f":"Eingabeblatt!R330","v":{"$error":"#DIV/0!"}},{"$f":"Eingabeblatt!Q330","v":{"$error":"#DIV/0!"}}]
[null,null,null,null,{"$f":"Eingabeblatt!R331","v":{"$error":"#DIV/0!"}},{"$f":"Eingabeblatt!Q331","v":{"$error":"#DIV/0!"}}]
[null,null,null,null,{"$f":"Eingabeblatt!R332","v":{"$error":"#DIV/0!"}},{"$f":"Eingabeblatt!Q332","v":{"$error":"#DIV/0!"}}]
[null,null,null,null,{"$f":"Eingabeblatt!R333","v":{"$error":"#DIV/0!"}},{"$f":"Eingabeblatt!Q333","v":{"$error":"#DIV/0!"}}]
[null,null,null,null,{"$f":"Eingabeblatt!R334","v":{"$error":"#DIV/0!"}},{"$f":"Eingabeblatt!Q334","v":{"$error":"#DIV/0!"}}]
[null,null,null,null,{"$f":"Eingabeblatt!R335","v":{"$error":"#DIV/0!"}},{"$f":"Eingabeblatt!Q335","v":{"$error":"#DIV/0!"}}]
[null,null,null,null,{"$f":"Eingabeblatt!R336","v":{"$error":"#DIV/0!"}},{"$f":"Eingabeblatt!Q336","v":{"$error":"#DIV/0!"}}]
[null,null,null,null,{"$f":"Eingabeblatt!R337","v":{"$error":"#DIV/0!"}},{"$f":"Eingabeblatt!Q337","v":{"$error":"#DIV/0!"}}]
[null,null,null,null,{"$f":"Eingabeblatt!R338","v":{"$error":"#DIV/0!"}},{"$f":"Eingabeblatt!Q338","v":{"$error":"#DIV/0!"}}]
[null,null,null,null,{"$f":"Eingabeblatt!R339","v":{"$error":"#DIV/0!"}},{"$f":"Eingabeblatt!Q339","v":{"$error":"#DIV/0!"}}]
[null,null,null,null,{"$f":"Eingabeblatt!R340","v":{"$error":"#DIV/0!"}},{"$f":"Eingabeblatt!Q340","v":{"$error":"#DIV/0!"}}]
[null,null,null,null,{"$f":"Eingabeblatt!R341","v":{"$error":"#DIV/0!"}},{"$f":"Eingabeblatt!Q341","v":{"$error":"#DIV/0!"}}]
[null,null,null,null,{"$f":"Eingabeblatt!R342","v":{"$error":"#DIV/0!"}},{"$f":"Eingabeblatt!Q342","v":{"$error":"#DIV/0!"}}]
[null,null,null,null,{"$f":"Eingabeblatt!R343","v":{"$error":"#DIV/0!"}},{"$f":"Eingabeblatt!Q343","v":{"$error":"#DIV/0!"}}]
[null,null,null,null,{"$f":"Eingabeblatt!R344","v":{"$error":"#DIV/0!"}},{"$f":"Eingabeblatt!Q344","v":{"$error":"#DIV/0!"}}]
[null,null,null,null,{"$f":"Eingabeblatt!R345","v":{"$error":"#DIV/0!"}},{"$f":"Eingabeblatt!Q345","v":{"$error":"#DIV/0!"}}]
[null,null,null,null,{"$f":"Eingabeblatt!R346","v":{"$error":"#DIV/0!"}},{"$f":"Eingabeblatt!Q346","v":{"$error":"#DIV/0!"}}]
[null,null,null,null,{"$f":"Eingabeblatt!R347","v":{"$error":"#DIV/0!"}},{"$f":"Eingabeblatt!Q347","v":{"$error":"#DIV/0!"}}]
[null,null,null,null,{"$f":"Eingabeblatt!R348","v":{"$error":"#DIV/0!"}},{"$f":"Eingabeblatt!Q348","v":{"$error":"#DIV/0!"}}]
[null,null,null,null,{"$f":"Eingabeblatt!R349","v":{"$error":"#DIV/0!"}},{"$f":"Eingabeblatt!Q349","v":{"$error":"#DIV/0!"}}]
[null,null,null,null,{"$f":"Eingabeblatt!R350","v":{"$error":"#DIV/0!"}},{"$f":"Eingabeblatt!Q350","v":{"$error":"#DIV/0!"}}]
[null,null,null,null,{"$f":"Eingabeblatt!R351","v":{"$error":"#DIV/0!"}},{"$f":"Eingabeblatt!Q351","v":{"$error":"#DIV/0!"}}]
[null,null,null,null,{"$f":"Eingabeblatt!R352","v":{"$error":"#DIV/0!"}},{"$f":"Eingabeblatt!Q352","v":{"$error":"#DIV/0!"}}]
[null,null,null,null,{"$f":"Eingabeblatt!R353","v":{"$error":"#DIV/0!"}},{"$f":"Eingabeblatt!Q353","v":{"$error":"#DIV/0!"}}]
[null,null,null,null,{"$f":"Eingabeblatt!R354","v":{"$error":"#DIV/0!"}},{"$f":"Eingabeblatt!Q354","v":{"$error":"#DIV/0!"}}]
[null,null,null,null,{"$f":"Eingabeblatt!R355","v":{"$error":"#DIV/0!"}},{"$f":"Eingabeblatt!Q355","v":{"$error":"#DIV/0!"}}]
[null,null,null,null,{"$f":"Eingabeblatt!R356","v":{"$error":"#DIV/0!"}},{"$f":"Eingabeblatt!Q356","v":{"$error":"#DIV/0!"}}]
[null,null,null,null,{"$f":"Eingabeblatt!R357","v":{"$error":"#DIV/0!"}},{"$f":"Eingabeblatt!Q357","v":{"$error":"#DIV/0!"}}]
[null,null,null,null,{"$f":"Eingabeblatt!R358","v":{"$error":"#DIV/0!"}},{"$f":"Eingabeblatt!Q358","v":{"$error":"#DIV/0!"}}]
[null,null,null,null,{"$f":"Eingabeblatt!R359","v":{"$error":"#DIV/0!"}},{"$f":"Eingabeblatt!Q359","v":{"$error":"#DIV/0!"}}]
[null,null,null,null,{"$f":"Eingabeblatt!R360","v":{"$error":"#DIV/0!"}},{"$f":"Eingabeblatt!Q360","v":{"$error":"#DIV/0!"}}]
[null,null,null,null,{"$f":"Eingabeblatt!R361","v":{"$error":"#DIV/0!"}},{"$f":"Eingabeblatt!Q361","v":{"$error":"#DIV/0!"}}]
[null,null,null,null,{"$f":"Eingabeblatt!R362","v":{"$error":"#DIV/0!"}},{"$f":"Eingabeblatt!Q362","v":{"$error":"#DIV/0!"}}]
[null,null,null,null,{"$f":"Eingabeblatt!R363","v":{"$error":"#DIV/0!"}},{"$f":"Eingabeblatt!Q363","v":{"$error":"#DIV/0!"}}]
[null,null,null,null,{"$f":"Eingabeblatt!R364","v":{"$error":"#DIV/0!"}},{"$f":"Eingabeblatt!Q364","v":{"$error":"#DIV/0!"}}]
[null,null,null,null,{"$f":"Eingabeblatt!R365","v":{"$error":"#DIV/0!"}},{"$f":"Eingabeblatt!Q365","v":{"$error":"#DIV/0!"}}]
[null,null,null,null,{"$f":"Eingabeblatt!R366","v":{"$error":"#DIV/0!"}},{"$f":"Eingabeblatt!Q366","v":{"$error":"#DIV/0!"}}]
[null,null,null,null,{"$f":"Eingabeblatt!R367","v":{"$error":"#DIV/0!"}},{"$f":"Eingabeblatt!Q367","v":{"$error":"#DIV/0!"}}]
[null,null,null,null,{"$f":"Eingabeblatt!R368","v":{"$error":"#DIV/0!"}},{"$f":"Eingabeblatt!Q368","v":{"$error":"#DIV/0!"}}]
[null,null,null,null,{"$f":"Eingabeblatt!R369","v":{"$error":"#DIV/0!"}},{"$f":"Eingabeblatt!Q369","v":{"$error":"#DIV/0!"}}]
[null,null,null,null,{"$f":"Eingabeblatt!R370","v":{"$error":"#DIV/0!"}},{"$f":"Eingabeblatt!Q370","v":{"$error":"#DIV/0!"}}]
[null,null,null,null,{"$f":"Eingabeblatt!R371","v":{"$error":"#DIV/0!"}},{"$f":"Eingabeblatt!Q371","v":{"$error":"#DIV/0!"}}]
[null,null,null,null,{"$f":"Eingabeblatt!R372","v":{"$error":"#DIV/0!"}},{"$f":"Eingabeblatt!Q372","v":{"$error":"#DIV/0!"}}]
[null,null,null,null,{"$f":"Eingabeblatt!R373","v":{"$error":"#DIV/0!"}},{"$f":"Eingabeblatt!Q373","v":{"$error":"#DIV/0!"}}]
[null,null,null,null,{"$f":"Eingabeblatt!R374","v":{"$error":"#DIV/0!"}},{"$f":"Eingabeblatt!Q374","v":{"$error":"#DIV/0!"}}]
[null,null,null,null,{"$f":"Eingabeblatt!R375","v":{"$error":"#DIV/0!"}},{"$f":"Eingabeblatt!Q375","v":{"$error":"#DIV/0!"}}]
[null,null,null,null,{"$f":"Eingabeblatt!R376","v":{"$error":"#DIV/0!"}},{"$f":"Eingabeblatt!Q376","v":{"$error":"#DIV/0!"}}]
[null,null,null,null,{"$f":"Eingabeblatt!R377","v":{"$error":"#DIV/0!"}},{"$f":"Eingabeblatt!Q377","v":{"$error":"#DIV/0!"}}]
[null,null,null,null,{"$f":"Eingabeblatt!R378","v":{"$error":"#DIV/0!"}},{"$f":"Eingabeblatt!Q378","v":{"$error":"#DIV/0!"}}]
[null,null,null,null,{"$f":"Eingabeblatt!R379","v":{"$error":"#DIV/0!"}},{"$f":"Eingabeblatt!Q379","v":{"$error":"#DIV/0!"}}]
[null,null,null,null,{"$f":"Eingabeblatt!R380","v":{"$error":"#DIV/0!"}},{"$f":"Eingabeblatt!Q380","v":{"$error":"#DIV/0!"}}]
[null,null,null,null,{"$f":"Eingabeblatt!R381","v":{"$error":"#DIV/0!"}},{"$f":"Eingabeblatt!Q381","v":{"$error":"#DIV/0!"}}]
[null,null,null,null,{"$f":"Eingabeblatt!R382","v":{"$error":"#DIV/0!"}},{"$f":"Eingabeblatt!Q382","v":{"$error":"#DIV/0!"}}]
[null,null,null,null,{"$f":"Eingabeblatt!R383","v":{"$error":"#DIV/0!"}},{"$f":"Eingabeblatt!Q383","v":{"$error":"#DIV/0!"}}]
[null,null,null,null,{"$f":"Eingabeblatt!R384","v":{"$error":"#DIV/0!"}},{"$f":"Eingabeblatt!Q384","v":{"$error":"#DIV/0!"}}]
[null,null,null,null,{"$f":"Eingabeblatt!R385","v":{"$error":"#DIV/0!"}},{"$f":"Eingabeblatt!Q385","v":{"$error":"#DIV/0!"}}]
[null,null,null,null,{"$f":"Eingabeblatt!R386","v":{"$error":"#DIV/0!"}},{"$f":"Eingabeblatt!Q386","v":{"$error":"#DIV/0!"}}]
[null,null,null,null,{"$f":"Eingabeblatt!R387","v":{"$error":"#DIV/0!"}},{"$f":"Eingabeblatt!Q387","v":{"$error":"#DIV/0!"}}]
[null,null,null,null,{"$f":"Eingabeblatt!R388","v":{"$error":"#DIV/0!"}},{"$f":"Eingabeblatt!Q388","v":{"$error":"#DIV/0!"}}]
[null,null,null,null,{"$f":"Eingabeblatt!R389","v":{"$error":"#DIV/0!"}},{"$f":"Eingabeblatt!Q389","v":{"$error":"#DIV/0!"}}]
[null,null,null,null,{"$f":"Eingabeblatt!R390","v":{"$error":"#DIV/0!"}},{"$f":"Eingabeblatt!Q390","v":{"$error":"#DIV/0!"}}]
[null,null,null,null,{"$f":"Eingabeblatt!R391","v":{"$error":"#DIV/0!"}},{"$f":"Eingabeblatt!Q391","v":{"$error":"#DIV/0!"}}]
[null,null,null,null,{"$f":"Eingabeblatt!R392","v":{"$error":"#DIV/0!"}},{"$f":"Eingabeblatt!Q392","v":{"$error":"#DIV/0!"}}]
[null,null,null,null,{"$f":"Eingabeblatt!R393","v":{"$error":"#DIV/0!"}},{"$f":"Eingabeblatt!Q393","v":{"$error":"#DIV/0!"}}]
[null,null,null,null,{"$f":"Eingabeblatt!R394","v":{"$error":"#DIV/0!"}},{"$f":"Eingabeblatt!Q394","v":{"$error":"#DIV/0!"}}]
[null,null,null,null,{"$f":"Eingabeblatt!R395","v":{"$error":"#DIV/0!"}},{"$f":"Eingabeblatt!Q395","v":{"$error":"#DIV/0!"}}]
[null,null,null,null,{"$f":"Eingabeblatt!R396","v":{"$error":"#DIV/0!"}},{"$f":"Eingabeblatt!Q396","v":{"$error":"#DIV/0!"}}]
[null,null,null,null,{"$f":"Eingabeblatt!R397","v":{"$error":"#DIV/0!"}},{"$f":"Eingabeblatt!Q397","v":{"$error":"#DIV/0!"}}]
[null,null,null,null,{"$f":"Eingabeblatt!R398","v":{"$error":"#DIV/0!"}},{"$f":"Eingabeblatt!Q398","v":{"$error":"#DIV/0!"}}]
[null,null,null,null,{"$f":"Eingabeblatt!R399","v":{"$error":"#DIV/0!"}},{"$f":"Eingabeblatt!Q399","v":{"$error":"#DIV/0!"}}]
[null,null,null,null,{"$f":"Eingabeblatt!R400","v":{"$error":"#DIV/0!"}},{"$f":"Eingabeblatt!Q400","v":{"$error":"#DIV/0!"}}]
[null,null,null,null,{"$f":"Eingabeblatt!R401","v":{"$error":"#DIV/0!"}},{"$f":"Eingabeblatt!Q401","v":{"$error":"#DIV/0!"}}]
[null,null,null,null,{"$f":"Eingabeblatt!R402","v":{"$error":"#DIV/0!"}},{"$f":"Eingabeblatt!Q402","v":{"$error":"#DIV/0!"}}]
[null,null,null,null,{"$f":"Eingabeblatt!R403","v":{"$error":"#DIV/0!"}},{"$f":"Eingabeblatt!Q403","v":{"$error":"#DIV/0!"}}]
[null,null,null,null,{"$f":"Eingabeblatt!R404","v":{"$error":"#DIV/0!"}},{"$f":"Eingabeblatt!Q404","v":{"$error":"#DIV/0!"}}]
[null,null,null,null,{"$f":"Eingabeblatt!R405","v":{"$error":"#DIV/0!"}},{"$f":"Eingabeblatt!Q405","v":{"$error":"#DIV/0!"}}]
[null,null,null,null,{"$f":"Eingabeblatt!R406","v":{"$error":"#DIV/0!"}},{"$f":"Eingabeblatt!Q406","v":{"$error":"#DIV/0!"}}]
[null,null,null,null,{"$f":"Eingabeblatt!R407","v":{"$error":"#DIV/0!"}},{"$f":"Eingabeblatt!Q407","v":{"$error":"#DIV/0!"}}]
[null,null,null,null,{"$f":"Eingabeblatt!R408","v":{"$error":"#DIV/0!"}},{"$f":"Eingabeblatt!Q408","v":{"$error":"#DIV/0!"}}]
[null,null,null,null,{"$f":"Eingabeblatt!R409","v":{"$error":"#DIV/0!"}},{"$f":"Eingabeblatt!Q409","v":{"$error":"#DIV/0!"}}]
[null,null,null,null,{"$f":"Eingabeblatt!R410","v":{"$error":"#DIV/0!"}},{"$f":"Eingabeblatt!Q410","v":{"$error":"#DIV/0!"}}]
[null,null,null,null,{"$f":"Eingabeblatt!R411","v":{"$error":"#DIV/0!"}},{"$f":"Eingabeblatt!Q411","v":{"$error":"#DIV/0!"}}]
[null,null,null,null,{"$f":"Eingabeblatt!R412","v":{"$error":"#DIV/0!"}},{"$f":"Eingabeblatt!Q412","v":{"$error":"#DIV/0!"}}]
[null,null,null,null,{"$f":"Eingabeblatt!R413","v":{"$error":"#DIV/0!"}},{"$f":"Eingabeblatt!Q413","v":{"$error":"#DIV/0!"}}]
[null,null,null,null,{"$f":"Eingabeblatt!R414","v":{"$error":"#DIV/0!"}},{"$f":"Eingabeblatt!Q414","v":{"$error":"#DIV/0!"}}]
[null,null,null,null,{"$f":"Eingabeblatt!R415","v":{"$error":"#DIV/0!"}},{"$f":"Eingabeblatt!Q415","v":{"$error":"#DIV/0!"}}]
[null,null,null,null,{"$f":"Eingabeblatt!R416","v":{"$error":"#DIV/0!"}},{"$f":"Eingabeblatt!Q416","v":{"$error":"#DIV/0!"}}]
[null,null,null,null,{"$f":"Eingabeblatt!R417","v":{"$error":"#DIV/0!"}},{"$f":"Eingabeblatt!Q417","v":{"$error":"#DIV/0!"}}]
[null,null,null,null,{"$f":"Eingabeblatt!R418","v":{"$error":"#DIV/0!"}},{"$f":"Eingabeblatt!Q418","v":{"$error":"#DIV/0!"}}]
[null,null,null,null,{"$f":"Eingabeblatt!R419","v":{"$error":"#DIV/0!"}},{"$f":"Eingabeblatt!Q419","v":{"$error":"#DIV/0!"}}]
[null,null,null,null,{"$f":"Eingabeblatt!R420","v":{"$error":"#DIV/0!"}},{"$f":"Eingabeblatt!Q420","v":{"$error":"#DIV/0!"}}]
[null,null,null,null,{"$f":"Eingabeblatt!R421","v":{"$error":"#DIV/0!"}},{"$f":"Eingabeblatt!Q421","v":{"$error":"#DIV/0!"}}]
[null,null,null,null,{"$f":"Eingabeblatt!R422","v":{"$error":"#DIV/0!"}},{"$f":"Eingabeblatt!Q422","v":{"$error":"#DIV/0!"}}]
[null,null,null,null,{"$f":"Eingabeblatt!R423","v":{"$error":"#DIV/0!"}},{"$f":"Eingabeblatt!Q423","v":{"$error":"#DIV/0!"}}]
[null,null,null,null,{"$f":"Eingabeblatt!R424","v":{"$error":"#DIV/0!"}},{"$f":"Eingabeblatt!Q424","v":{"$error":"#DIV/0!"}}]
[null,null,null,null,{"$f":"Eingabeblatt!R425","v":{"$error":"#DIV/0!"}},{"$f":"Eingabeblatt!Q425","v":{"$error":"#DIV/0!"}}]
[null,null,null,null,{"$f":"Eingabeblatt!R426","v":{"$error":"#DIV/0!"}},{"$f":"Eingabeblatt!Q426","v":{"$error":"#DIV/0!"}}]
[null,null,null,null,{"$f":"Eingabeblatt!R427","v":{"$error":"#DIV/0!"}},{"$f":"Eingabeblatt!Q427","v":{"$error":"#DIV/0!"}}]
[null,null,null,null,{"$f":"Eingabeblatt!R428","v":{"$error":"#DIV/0!"}},{"$f":"Eingabeblatt!Q428","v":{"$error":"#DIV/0!"}}]
[null,null,null,null,{"$f":"Eingabeblatt!R429","v":{"$error":"#DIV/0!"}},{"$f":"Eingabeblatt!Q429","v":{"$error":"#DIV/0!"}}]
[null,null,null,null,{"$f":"Eingabeblatt!R430","v":{"$error":"#DIV/0!"}},{"$f":"Eingabeblatt!Q430","v":{"$error":"#DIV/0!"}}]
[null,null,null,null,{"$f":"Eingabeblatt!R431","v":{"$error":"#DIV/0!"}},{"$f":"Eingabeblatt!Q431","v":{"$error":"#DIV/0!"}}]
[null,null,null,null,{"$f":"Eingabeblatt!R432","v":{"$error":"#DIV/0!"}},{"$f":"Eingabeblatt!Q432","v":{"$error":"#DIV/0!"}}]
[null,null,null,null,{"$f":"Eingabeblatt!R433","v":{"$error":"#DIV/0!"}},{"$f":"Eingabeblatt!Q433","v":{"$error":"#DIV/0!"}}]
[null,null,null,null,{"$f":"Eingabeblatt!R434","v":{"$error":"#DIV/0!"}},{"$f":"Eingabeblatt!Q434","v":{"$error":"#DIV/0!"}}]
[null,null,null,null,{"$f":"Eingabeblatt!R435","v":{"$error":"#DIV/0!"}},{"$f":"Eingabeblatt!Q435","v":{"$error":"#DIV/0!"}}]
[null,null,null,null,{"$f":"Eingabeblatt!R436","v":{"$error":"#DIV/0!"}},{"$f":"Eingabeblatt!Q436","v":{"$error":"#DIV/0!"}}]
[null,null,null,null,{"$f":"Eingabeblatt!R437","v":{"$error":"#DIV/0!"}},{"$f":"Eingabeblatt!Q437","v":{"$error":"#DIV/0!"}}]
[null,null,null,null,{"$f":"Eingabeblatt!R438","v":{"$error":"#DIV/0!"}},{"$f":"Eingabeblatt!Q438","v":{"$error":"#DIV/0!"}}]
[null,null,null,null,{"$f":"Eingabeblatt!R439","v":{"$error":"#DIV/0!"}},{"$f":"Eingabeblatt!Q439","v":{"$error":"#DIV/0!"}}]
[null,null,null,null,{"$f":"Eingabeblatt!R440","v":{"$error":"#DIV/0!"}},{"$f":"Eingabeblatt!Q440","v":{"$error":"#DIV/0!"}}]
[null,null,null,null,{"$f":"Eingabeblatt!R441","v":{"$error":"#DIV/0!"}},{"$f":"Eingabeblatt!Q441","v":{"$error":"#DIV/0!"}}]
[null,null,null,null,{"$f":"Eingabeblatt!R442","v":{"$error":"#DIV/0!"}},{"$f":"Eingabeblatt!Q442","v":{"$error":"#DIV/0!"}}]
[null,null,null,null,{"$f":"Eingabeblatt!R443","v":{"$error":"#DIV/0!"}},{"$f":"Eingabeblatt!Q443","v":{"$error":"#DIV/0!"}}]
[null,null,null,null,{"$f":"Eingabeblatt!R444","v":{"$error":"#DIV/0!"}},{"$f":"Eingabeblatt!Q444","v":{"$error":"#DIV/0!"}}]
[null,null,null,null,{"$f":"Eingabeblatt!R445","v":{"$error":"#DIV/0!"}},{"$f":"Eingabeblatt!Q445","v":{"$error":"#DIV/0!"}}]
[null,null,null,null,{"$f":"Eingabeblatt!R446","v":{"$error":"#DIV/0!"}},{"$f":"Eingabeblatt!Q446","v":{"$error":"#DIV/0!"}}]
[null,null,null,null,{"$f":"Eingabeblatt!R447","v":{"$error":"#DIV/0!"}},{"$f":"Eingabeblatt!Q447","v":{"$error":"#DIV/0!"}}]
[null,null,null,null,{"$f":"Eingabeblatt!R448","v":{"$error":"#DIV/0!"}},{"$f":"Eingabeblatt!Q448","v":{"$error":"#DIV/0!"}}]
[null,null,null,null,{"$f":"Eingabeblatt!R449","v":{"$error":"#DIV/0!"}},{"$f":"Eingabeblatt!Q449","v":{"$error":"#DIV/0!"}}]
[null,null,null,null,{"$f":"Eingabeblatt!R450","v":{"$error":"#DIV/0!"}},{"$f":"Eingabeblatt!Q450","v":{"$error":"#DIV/0!"}}]
[null,null,null,null,{"$f":"Eingabeblatt!R451","v":{"$error":"#DIV/0!"}},{"$f":"Eingabeblatt!Q451","v":{"$error":"#DIV/0!"}}]
[null,null,null,null,{"$f":"Eingabeblatt!R452","v":{"$error":"#DIV/0!"}},{"$f":"Eingabeblatt!Q452","v":{"$error":"#DIV/0!"}}]
[null,null,null,null,{"$f":"Eingabeblatt!R453","v":{"$error":"#DIV/0!"}},{"$f":"Eingabeblatt!Q453","v":{"$error":"#DIV/0!"}}]
[null,null,null,null,{"$f":"Eingabeblatt!R454","v":{"$error":"#DIV/0!"}},{"$f":"Eingabeblatt!Q454","v":{"$error":"#DIV/0!"}}]
[null,null,null,null,{"$f":"Eingabeblatt!R455","v":{"$error":"#DIV/0!"}},{"$f":"Eingabeblatt!Q455","v":{"$error":"#DIV/0!"}}]
[null,null,null,null,{"$f":"Eingabeblatt!R456","v":{"$error":"#DIV/0!"}},{"$f":"Eingabeblatt!Q456","v":{"$error":"#DIV/0!"}}]
[null,null,null,null,{"$f":"Eingabeblatt!R457","v":{"$error":"#DIV/0!"}},{"$f":"Eingabeblatt!Q457","v":{"$error":"#DIV/0!"}}]
[null,null,null,null,{"$f":"Eingabeblatt!R458","v":{"$error":"#DIV/0!"}},{"$f":"Eingabeblatt!Q458","v":{"$error":"#DIV/0!"}}]
[null,null,null,null,{"$f":"Eingabeblatt!R459","v":{"$error":"#DIV/0!"}},{"$f":"Eingabeblatt!Q459","v":{"$error":"#DIV/0!"}}]
[null,null,null,null,{"$f":"Eingabeblatt!R460","v":{"$error":"#DIV/0!"}},{"$f":"Eingabeblatt!Q460","v":{"$error":"#DIV/0!"}}]
[null,null,null,null,{"$f":"Eingabeblatt!R461","v":{"$error":"#DIV/0!"}},{"$f":"Eingabeblatt!Q461","v":{"$error":"#DIV/0!"}}]
[null,null,null,null,{"$f":"Eingabeblatt!R462","v":{"$error":"#DIV/0!"}},{"$f":"Eingabeblatt!Q462","v":{"$error":"#DIV/0!"}}]
[null,null,null,null,{"$f":"Eingabeblatt!R463","v":{"$error":"#DIV/0!"}},{"$f":"Eingabeblatt!Q463","v":{"$error":"#DIV/0!"}}]
[null,null,null,null,{"$f":"Eingabeblatt!R464","v":{"$error":"#DIV/0!"}},{"$f":"Eingabeblatt!Q464","v":{"$error":"#DIV/0!"}}]
[null,null,null,null,{"$f":"Eingabeblatt!R465","v":{"$error":"#DIV/0!"}},{"$f":"Eingabeblatt!Q465","v":{"$error":"#DIV/0!"}}]
[null,null,null,null,{"$f":"Eingabeblatt!R466","v":{"$error":"#DIV/0!"}},{"$f":"Eingabeblatt!Q466","v":{"$error":"#DIV/0!"}}]
[null,null,null,null,{"$f":"Eingabeblatt!R467","v":{"$error":"#DIV/0!"}},{"$f":"Eingabeblatt!Q467","v":{"$error":"#DIV/0!"}}]
[null,null,null,null,{"$f":"Eingabeblatt!R468","v":{"$error":"#DIV/0!"}},{"$f":"Eingabeblatt!Q468","v":{"$error":"#DIV/0!"}}]
[null,null,null,null,{"$f":"Eingabeblatt!R469","v":{"$error":"#DIV/0!"}},{"$f":"Eingabeblatt!Q469","v":{"$error":"#DIV/0!"}}]
[null,null,null,null,{"$f":"Eingabeblatt!R470","v":{"$error":"#DIV/0!"}},{"$f":"Eingabeblatt!Q470","v":{"$error":"#DIV/0!"}}]
[null,null,null,null,{"$f":"Eingabeblatt!R471","v":{"$error":"#DIV/0!"}},{"$f":"Eingabeblatt!Q471","v":{"$error":"#DIV/0!"}}]
[null,null,null,null,{"$f":"Eingabeblatt!R472","v":{"$error":"#DIV/0!"}},{"$f":"Eingabeblatt!Q472","v":{"$error":"#DIV/0!"}}]
[null,null,null,null,{"$f":"Eingabeblatt!R473","v":{"$error":"#DIV/0!"}},{"$f":"Eingabeblatt!Q473","v":{"$error":"#DIV/0!"}}]
[null,null,null,null,{"$f":"Eingabeblatt!R474","v":{"$error":"#DIV/0!"}},{"$f":"Eingabeblatt!Q474","v":{"$error":"#DIV/0!"}}]
[null,null,null,null,{"$f":"Eingabeblatt!R475","v":{"$error":"#DIV/0!"}},{"$f":"Eingabeblatt!Q475","v":{"$error":"#DIV/0!"}}]
[null,null,null,null,{"$f":"Eingabeblatt!R476","v":{"$error":"#DIV/0!"}},{"$f":"Eingabeblatt!Q476","v":{"$error":"#DIV/0!"}}]
[null,null,null,null,{"$f":"Eingabeblatt!R477","v":{"$error":"#DIV/0!"}},{"$f":"Eingabeblatt!Q477","v":{"$error":"#DIV/0!"}}]
[null,null,null,null,{"$f":"Eingabeblatt!R478","v":{"$error":"#DIV/0!"}},{"$f":"Eingabeblatt!Q478","v":{"$error":"#DIV/0!"}}]
[null,null,null,null,{"$f":"Eingabeblatt!R479","v":{"$error":"#DIV/0!"}},{"$f":"Eingabeblatt!Q479","v":{"$error":"#DIV/0!"}}]
[null,null,null,null,{"$f":"Eingabeblatt!R480","v":{"$error":"#DIV/0!"}},{"$f":"Eingabeblatt!Q480","v":{"$error":"#DIV/0!"}}]
[null,null,null,null,{"$f":"Eingabeblatt!R481","v":{"$error":"#DIV/0!"}},{"$f":"Eingabeblatt!Q481","v":{"$error":"#DIV/0!"}}]
[null,null,null,null,{"$f":"Eingabeblatt!R482","v":{"$error":"#DIV/0!"}},{"$f":"Eingabeblatt!Q482","v":{"$error":"#DIV/0!"}}]
[null,null,null,null,{"$f":"Eingabeblatt!R483","v":{"$error":"#DIV/0!"}},{"$f":"Eingabeblatt!Q483","v":{"$error":"#DIV/0!"}}]
[null,null,null,null,{"$f":"Eingabeblatt!R484","v":{"$error":"#DIV/0!"}},{"$f":"Eingabeblatt!Q484","v":{"$error":"#DIV/0!"}}]
[null,null,null,null,{"$f":"Eingabeblatt!R485","v":{"$error":"#DIV/0!"}},{"$f":"Eingabeblatt!Q485","v":{"$error":"#DIV/0!"}}]
[null,null,null,null,{"$f":"Eingabeblatt!R486","v":{"$error":"#DIV/0!"}},{"$f":"Eingabeblatt!Q486","v":{"$error":"#DIV/0!"}}]
[null,null,null,null,{"$f":"Eingabeblatt!R487","v":{"$error":"#DIV/0!"}},{"$f":"Eingabeblatt!Q487","v":{"$error":"#DIV/0!"}}]
[null,null,null,null,{"$f":"Eingabeblatt!R488","v":{"$error":"#DIV/0!"}},{"$f":"Eingabeblatt!Q488","v":{"$error":"#DIV/0!"}}]
[null,null,null,null,{"$f":"Eingabeblatt!R489","v":{"$error":"#DIV/0!"}},{"$f":"Eingabeblatt!Q489","v":{"$error":"#DIV/0!"}}]
[null,null,null,null,{"$f":"Eingabeblatt!R490","v":{"$error":"#DIV/0!"}},{"$f":"Eingabeblatt!Q490","v":{"$error":"#DIV/0!"}}]
[null,null,null,null,{"$f":"Eingabeblatt!R491","v":{"$error":"#DIV/0!"}},{"$f":"Eingabeblatt!Q491","v":{"$error":"#DIV/0!"}}]
[null,null,null,null,{"$f":"Eingabeblatt!R492","v":{"$error":"#DIV/0!"}},{"$f":"Eingabeblatt!Q492","v":{"$error":"#DIV/0!"}}]
[null,null,null,null,{"$f":"Eingabeblatt!R493","v":{"$error":"#DIV/0!"}},{"$f":"Eingabeblatt!Q493","v":{"$error":"#DIV/0!"}}]
[null,null,null,null,{"$f":"Eingabeblatt!R494","v":{"$error":"#DIV/0!"}},{"$f":"Eingabeblatt!Q494","v":{"$error":"#DIV/0!"}}]
[null,null,null,null,{"$f":"Eingabeblatt!R495","v":{"$error":"#DIV/0!"}},{"$f":"Eingabeblatt!Q495","v":{"$error":"#DIV/0!"}}]
[null,null,null,null,{"$f":"Eingabeblatt!R496","v":{"$error":"#DIV/0!"}},{"$f":"Eingabeblatt!Q496","v":{"$error":"#DIV/0!"}}]
[null,null,null,null,{"$f":"Eingabeblatt!R497","v":{"$error":"#DIV/0!"}},{"$f":"Eingabeblatt!Q497","v":{"$error":"#DIV/0!"}}]
[null,null,null,null,{"$f":"Eingabeblatt!R498","v":{"$error":"#DIV/0!"}},{"$f":"Eingabeblatt!Q498","v":{"$error":"#DIV/0!"}}]
[null,null,null,null,{"$f":"Eingabeblatt!R499","v":{"$error":"#DIV/0!"}},{"$f":"Eingabeblatt!Q499","v":{"$error":"#DIV/0!"}}]
[null,null,null,null,{"$f":"Eingabeblatt!R500","v":{"$error":"#DIV/0!"}},{"$f":"Eingabeblatt!Q500","v":{"$error":"#DIV/0!"}}]

{"sheet":"Berechnung_Male","index":4,"n_rows":55,"n_cols":6,"rows_kept":55,"cut":false,"hidden":true,"merged":[[51,0,51,2],[54,0,57,3]]}
["Year from PHV","early","average","late"]
[-4,45.29,40.090000000000003,34.729999999999997,null,"männlich"]
[-3.8,44.21,39.08,33.83]
[-3.6,43.11,38.07,32.94]
[-3.4,41.99,37.06,32.049999999999997]
[-3.2,40.85,36.049999999999997,31.16]
[-3,39.69,35.04,30.27]
[-2.8,38.520000000000003,34.04,29.38]
[-2.6,37.33,33.049999999999997,28.49]
[-2.4,36.15,32.06,27.6]
[-2.2000000000000002,34.97,31.07,26.7]
[-2,33.799999999999997,30.06,25.77]
[-1.8,32.619999999999997,29.03,24.79]
[-1.6,31.44,27.95,23.74]
[-1.4,30.23,26.83,22.63]
[-1.2,28.98,25.63,21.45]
[-1,27.66,24.36,20.22]
[-0.8,26.24,22.99,18.96]
[-0.6,24.68,21.51,17.68]
[-0.4,22.96,19.88,16.309999999999999]
[-0.2,21.07,18.09,14.76]
[0,19.04,16.16,13.05]
[0.2,16.96,14.21,11.32]
[0.4,14.92,12.35,9.7100000000000009]
[0.6,13.01,10.65,8.27]
[0.8,11.26,9.1199999999999992,6.94]
[1,9.6999999999999993,7.78,5.7]
[1.2,8.33,6.59,4.54]
[1.4,7.11,5.54,3.51]
[1.6,6.04,4.62,2.64]
[1.80000000000001,5.0999999999999996,3.8,1.92]
[2.0000000000000102,4.26,3.09,1.35]
[2.2000000000000099,3.52,2.48,0.91]
[2.4000000000000101,2.86,1.96,0.57999999999999996]
[2.6000000000000099,2.29,1.52,0.32]
[2.80000000000001,1.78,1.1599999999999999,0.13]
[3.0000000000000102,1.34,0.87,0]
[3.2000000000000099,0.96,0.63,0]
[3.4000000000000101,0.64,0.43,0]
[3.6000000000000099,0.37,0.27,0]
[3.80000000000001,0.16,0.12,0]
[4.0000000000000098,0,0,0]
[]
[]
["Alter",{"$f":"(#REF!-#REF!)/365","v":{"$error":"#REF!"}},null,"Maturity offset",{"$f":"-9.236+(0.0002708*B46*#REF!)+(-0.001663*B45*B46)+(0.007216*B45*#REF!)+(0.02292*(#REF!/#REF!)*100)","v":{"$error":"#REF!"}}]
["Beinlänge",{"$f":"#REF!-#REF!","v":{"$error":"#REF!"}},null,"PHV",{"$f":"B45-E45","v":{"$error":"#REF!"}}]
[null,null,null,"Spaltenangabe Tabelle",{"$f":"IF(E46<13,2,IF(E46<15,3,4))","v":{"$error":"#REF!"}}]
[]
["Wachstumsreserve",{"$f":"VLOOKUP(Berechnung_Male!$E$45,Berechnung_Male!$A$1:$D$42,Berechnung_Male!$E$47,TRUE)","v":{"$error":"#REF!"}}]
[]
[]
[{"$f":"Eingabeblatt!Q5=IF(Berechnung_Male!$E$46<13,\"Früh entwickelt.\",IF(Berechnung_Male!$E$46<=13.5,\"Möglicherweise früh entwickelt.\",IF(Berechnung_Male!$E$46>15,\"Spät entwickelt.\",IF(Berechnung_Male!$E$46>=14.5,\"Möglicherweise spät entwickelt.\",\"Durchschnittlich entwickelt.\"))))","v":{"$error":"#REF!"}}]
[]
[]
[{"$f":"IF(Berechnung_Male!$E$46<13,\"Der biologische Entwicklungstand des Athleten ist wahrscheinlich beschleunigt; Dh. im Vergleich mit Gleichalterigen wird seine Leistung ev. überschätzt! \",IF(Berechnung_Male!$E$46<=13.5,\"Der biologische Entwicklungstand des Athleten ist möglicherweise beschleunigt; Dh. im Vergleich mit Gleichalterigen wird seine Leistung möglicherweise überschätzt! \",IF(Berechnung_Male!$E$46>15,\"Der biologische Entwicklungsstand des Athleten ist wahrscheinlich verzögert; Dh. im Vergleich mit Gleichalterigen wird seine Leistung ev. unterschätzt!\",IF(Berechnung_Male!$E$46>=14.5,\"Der biologische Entwicklungsstand des Athleten ist möglicherweise verzögert; Dh. im Vergleich mit Gleichalterigen wird seine Leistung möglicherweise unterschätzt!\",\"Der biologische Entwicklungsstand des Athleten entspricht dem Alter.\"))))","v":{"$error":"#REF!"}}]

{"sheet":"Berechnung_Female","index":5,"n_rows":55,"n_cols":6,"rows_kept":55,"cut":false,"hidden":true,"merged":[[51,0,51,2],[54,0,57,3]]}
["Year from PHV","early","average","late"]
[-4,42.61,38.81,34.35,null,"weiblich"]
[-3.8,41.49,37.67,33.270000000000003]
[-3.6,40.39,36.549999999999997,32.200000000000003]
[-3.4,39.299999999999997,35.44,31.14]
[-3.2,38.21,34.340000000000003,30.09]
[-3,37.130000000000003,33.25,29.04]
[-2.8,36.04,32.159999999999997,27.99]
[-2.6,34.94,31.04,26.93]
[-2.4,33.82,29.91,25.87]
[-2.2000000000000002,32.68,28.76,24.79]
[-2,31.53,27.58,23.71]
[-1.8,30.44,26.39,22.63]
[-1.6,29.36,25.21,21.55]
[-1.4,28.24,24.03,20.47]
[-1.2,27.09,22.85,19.37]
[-1,25.87,21.66,18.25]
[-0.8,24.54,20.440000000000001,17.07]
[-0.6,23.09,19.16,15.81]
[-0.4,21.5,17.8,14.44]
[-0.2,19.77,16.329999999999998,12.94]
[0,17.940000000000001,14.75,11.36]
[0.2,16.09,13.13,9.81]
[0.4,14.3,11.56,8.42]
[0.6,12.64,10.11,7.2]
[0.8,11.11,8.77,6.12]
[1,9.69,7.52,5.13]
[1.2,8.39,6.37,4.24]
[1.4,7.2,5.33,3.46]
[1.6,6.14,4.42,2.8]
[1.80000000000001,5.19,3.64,2.25]
[2.0000000000000102,4.3600000000000003,2.99,1.82]
[2.2000000000000099,3.63,2.4500000000000002,1.46]
[2.4000000000000101,2.99,1.99,1.18]
[2.6000000000000099,2.42,1.6,0.94]
[2.80000000000001,1.92,1.26,0.74]
[3.0000000000000102,1.47,0.96,0.56999999999999995]
[3.2000000000000099,1.07,0.69,0.41]
[3.4000000000000101,0.72,0.46,0.28000000000000003]
[3.6000000000000099,0.43,0.26,0.17]
[3.80000000000001,0.19,0.11,0.08]
[4.0000000000000098,0,0,0]
[]
[]
["Alter",{"$f":"(#REF!-#REF!)/365","v":{"$error":"#REF!"}},null,"Maturity offset",{"$f":"-9.236+(0.0002708*B46*#REF!)+(-0.001663*B45*B46)+(0.007216*B45*#REF!)+(0.02292*(#REF!/#REF!)*100)","v":{"$error":"#REF!"}}]
["Beinlänge",{"$f":"#REF!-#REF!","v":{"$error":"#REF!"}},null,"PHV",{"$f":"B45-E45","v":{"$error":"#REF!"}}]
[null,null,null,"Spaltenangabe Tabelle",{"$f":"IF(E46<13,2,IF(E46<15,3,4))","v":{"$error":"#REF!"}}]
[]
["Wachstumsreserve",{"$f":"VLOOKUP(Berechnung_Female!$E$45,Berechnung_Female!$A$1:$D$42,Berechnung_Female!$E$47,TRUE)","v":{"$error":"#REF!"}}]
[]
[]
[{"$error":"#REF!"}]
[]
[]
[{"$f":"IF(Berechnung_Female!$E$46<13,\"Der biologische Entwicklungstand des Athleten ist wahrscheinlich beschleunigt; Dh. im Vergleich mit Gleichalterigen wird seine Leistung ev. überschätzt! \",IF(Berechnung_Female!$E$46<=13.5,\"Der biologische Entwicklungstand des Athleten ist möglicherweise beschleunigt; Dh. im Vergleich mit Gleichalterigen wird seine Leistung möglicherweise überschätzt! \",IF(Berechnung_Female!$E$46>15,\"Der biologische Entwicklungsstand des Athleten ist wahrscheinlich verzögert; Dh. im Vergleich mit Gleichalterigen wird seine Leistung ev. unterschätzt!\",IF(Berechnung_Female!$E$46>=14.5,\"Der biologische Entwicklungsstand des Athleten ist möglicherweise verzögert; Dh. im Vergleich mit Gleichalterigen wird seine Leistung möglicherweise unterschätzt!\",\"Der biologische Entwicklungsstand des Athleten entspricht dem Alter.\"))))","v":{"$error":"#REF!"}}]